{"text_format":"1","workbook":"xlsx","n_sheets":13,"sheets":["Inf","Quest T1","Quest T2","Therapist","DASS","REQ","MEAQ","IUS","MCQ","CERTS","SE","Self-Discr","Summary T1-T2"],"not_rendered":{"charts":39,"images":4,"macros":1,"external_links":0,"defined_names":21,"comments":0,"pivot_tables":0},"unopened":[],"bounds":{"document_bytes":16777216,"sheet_cells":100000,"rows_first":2000,"rows_last":500,"rows_between":2000,"halvings":0,"cell_chars":16384,"cell_head_chars":4096},"cells_cut":0,"cells_raw":0,"read":"whole","date_system":"1900"}

{"sheet":"Inf","index":0,"n_rows":24,"n_cols":551,"rows_kept":24,"cut":false,"hidden":false,"merged":[[13,2,13,10],[9,2,9,10],[10,2,10,10],[11,2,11,10],[12,2,12,10],[8,2,8,10],[3,2,3,10],[2,2,2,10],[1,2,1,10],[4,2,4,10],[5,2,5,10],[6,2,6,10],[7,2,7,10]]}
[]
[null,null,"Processes Assesment Protocol - Important Information"]
[null,null,"Pierre Philippot, Martine Bouvard, Céline Baeyens & Vincent Dethier"]
[null,null,"This file contains several worksheets:"]
[null,null,"The worksheet named \"Inf\" provides information regarding the use of this file."]
[null,null,"The Worksheets \"QuestT1\" and \"QuestT2\" allow the participant to fill in the questionnaires in directly the file. “QuestT1” collects the data at a time 1, and “QuestT2” at a time 2. The therapist has also  the possibility to encode a paper version directly in each of the worksheets. Time 2 is optional and allows to measure changes across time.  Please check that there are no missing answers before analyzing data. A red flag indicates missing answers. "]
[null,null,"The worksheet named \"Therapist\" is to be filled by the therapist in charge. This information is very important for research purpose. If you use the worksheet \"QuestT1\", some data will be filled in automatically in the worksheet “therapist”. "]
[null,null,"The following worksheets (DASS, REQ,...Self-Discr) relate to each of the questionnaires. It is possible to encode the data manually in the score column of each of the worksheets. Those worksheets provide means and percentiles of the various dimensions as well as graphs. In order to observe the results of the items of a specific dimension, you may click on the little arrow next to dimension (at the top) and select the dimension of interest.  "]
[null,null,"The worksheet named \"Summary\" allows to observe possible changes between time 1 and time 2 in regards to the therapeutic targets."]
[null,null,"In order to dislay all the worksheets (whenever a client/patient filled in \"Quest T1\" or \"Quest T2\"), please use the keyboard shortcut CTRL-D (Maintain CTRL and D simultaneously)."]
[null,null,"In order to hide all worksheets except \"Quest T1\", please use the keyboard shortcut CTRL-H. This allows to send the file to the client/patient with preventing the client/patient to view the other worksheets."]
[null,null,"In order to hide all worksheets except \"Quest T2\", please use the keyboard shortcut CTRL-J."]
[null,null,"If you agree to participate in this research, please send the completed files to vincent.dethier@uclouvain.be. One time of measurement is sufficient to do so. "]
[]
[]
[]
[]
[]
[]
[]
[]
[null,null,null,null,null,null,null,null,null,null,null,null,null,null,null,null,null,null,null,null,null,null,null,null,null,null,null,null,null,null,null,null,null,null,null,null,null,null,null,null,null,null,null,null,null,null,null,null,null,null,null,null,null,null,null,null,null,null,null,null,null,null,null,null,null,null,null,null,null,null,null,null,null,null,null,null,null,null,null,null,null,null,null,null,null,null,null,null,null,null,null,null,null,null,null,null,null,null,null,null,null,null,null,null,null,null,null,null,null,null,null,null,null,null,null,null,null,null,null,null,null,null,null,null,null,null,null,null,null,null,null,null,null,null,null,null,null,null,null,null,null,null,null,null,null,null,null,null,null,null,null,null,null,null,null,null,null,null,null,null,null,null,null,null,null,null,null,null,null,null,null,null,null,null,null,null,null,null,null,null,null,null,null,null,null,null,null,null,null,null,null,null,null,null,null,null,null,null,null,null,null,null,null,null,null,null,null,null,null,null,null,null,null,null,null,null,null,null,null,null,null,null,null,null,null,null,null,null,null,null,null,null,null,null,null,null,null,null,null,null,null,null,null,null,null,null,null,null,null,null,null,null,null,null,null,null,null,null,null,null,null,null,null,null,null,null,null,null,null,null,null,null,null,null,null,null,null,null,null,null,null,null,null,"T2 (facultatif)"]
[null,"Site","N° identification","Population","Age ","Sexe","Niveau d'étude ","Statut professionnel","Statut familial","Diag_1_code","Diag_1_int","Diag_2_code","Diag_2_int","Diag_3_code","Diag_3_int","OQ_1","OQ_2","OQ_3","OQ_4","OQ_5","OQ_6","OQ_7","OQ_8","OQ_9","OQ_10","OQ_11","OQ_12","OQ_13","OQ_14","OQ_15","OQ_16","OQ_17","OQ_18","OQ_19","OQ_20","OQ_21","OQ_22","OQ_23","OQ_24","OQ_25","OQ_26","OQ_27","OQ_28","OQ_29","OQ_30","OQ_31","OQ_32","OQ_33","OQ_34","OQ_35","OQ_36","OQ_37","OQ_38","OQ_39","OQ_40","OQ_41","OQ_42","OQ_43","OQ_44","OQ_45","DASS_1","DASS_2","DASS_3","DASS_4","DASS_5","DASS_6","DASS_7","DASS_8","DASS_9","DASS_10","DASS_11","DASS_12","DASS_13","DASS_14","DASS_15","DASS_16","DASS_17","DASS_18","DASS_19","DASS_20","DASS_21","REQ_1","REQ_2","REQ_3","REQ_4","REQ_5","REQ_6","REQ_7","REQ_8","REQ_9","REQ_10","REQ_11","REQ_12","REQ_13","REQ_14","REQ_15","REQ_16","REQ_17","REQ_18","REQ_19","REQ_20","REQ_21","MEAQ_1","MEAQ_2","MEAQ_3","MEAQ_4","MEAQ_5","MEAQ_6","MEAQ_7","MEAQ_8","MEAQ_9","MEAQ_10","MEAQ_11","MEAQ_12","MEAQ_13","MEAQ_14","MEAQ_15","MEAQ_16","MEAQ_17","MEAQ_18","MEAQ_19","MEAQ_20","MEAQ_21","MEAQ_22","MEAQ_23","MEAQ_24","MEAQ_25","MEAQ_26","MEAQ_27","MEAQ_28","MEAQ_29","MEAQ_30","MEAQ_31","MEAQ_32","MEAQ_33","MEAQ_34","MEAQ_35","MEAQ_36","MEAQ_37","MEAQ_38","MEAQ_39","MEAQ_40","MEAQ_41","MEAQ_42","MEAQ_43","MEAQ_44","MEAQ_45","MEAQ_46","MEAQ_47","MEAQ_48","MEAQ_49","MEAQ_50","MEAQ_51","MEAQ_52","MEAQ_53","MEAQ_54","MEAQ_55","MEAQ_56","MEAQ_57","MEAQ_58","MEAQ_59","MEAQ_60","MEAQ_61","MEAQ_62","EII_1","EII_2","EII_3","EII_4","EII_5","EII_6","EII_7","EII_8","EII_9","EII_10","EII_11","EII_12","EII_13","EII_14","EII_15","EII_16","EII_17","EII_18","EII_19","EII_20","EII_21","EII_22","EII_23","EII_24","EII_25","EII_26","EII_27","MCQ_1","MCQ_2","MCQ_3","MCQ_4","MCQ_5","MCQ_6","MCQ_7","MCQ_8","MCQ_9","MCQ_10","MCQ_11","MCQ_12","MCQ_13","MCQ_14","MCQ_15","MCQ_16","MCQ_17","MCQ_18","MCQ_19","MCQ_20","MCQ_21","MCQ_22","MCQ_23","MCQ_24","MCQ_25","MCQ_26","MCQ_27","MCQ_28","MCQ_29","MCQ_30","CERTS_1","CERTS_2","CERTS_3","CERTS_4","CERTS_5","CERTS_6","CERTS_7","CERTS_8","CERTS_9","CERTS_10","CERTS_11","CERTS_12","CERTS_13","CERTS_14","CERTS_15","CERTS_16","SEP_1","SEP_2","SEP_3","SEP_4","SEP_5","SEP_6","SEP_7","SEP_8","SEP_9","SEP_10","% Car. Id.1","% Car. Id.2","% Car. Id.3","% Car. Id.4","% Car. Id.5","% Car. Id.6","% Car. Id.7","% Car. Id.8","% Car. ~ Id.1","% Car. ~ Id.2","% Car. ~ Id.3","% Car. ~ Id.4","% Car. ~ Id.5","% Car. ~ Id.6","% Car. ~ Id.7","% Car. ~ Id.8","Ecart idéal","Détresse(1)","% Car. Soc 1","% Car. Soc 2","% Car. Soc 3","% Car. Soc 4","% Car. Soc 5","% Car. Soc 6","% Car. Soc 7","% Car. Soc 8","% Car.~ soc1","% Car.~ soc2","% Car.~ soc3","% Car.~ soc4","% Car.~ soc5","% Car.~ soc6","% Car.~ soc7","% Car.~ soc8","Ecart soc","Détresse 2","OQ_1","OQ_2","OQ_3","OQ_4","OQ_5","OQ_6","OQ_7","OQ_8","OQ_9","OQ_10","OQ_11","OQ_12","OQ_13","OQ_14","OQ_15","OQ_16","OQ_17","OQ_18","OQ_19","OQ_20","OQ_21","OQ_22","OQ_23","OQ_24","OQ_25","OQ_26","OQ_27","OQ_28","OQ_29","OQ_30","OQ_31","OQ_32","OQ_33","OQ_34","OQ_35","OQ_36","OQ_37","OQ_38","OQ_39","OQ_40","OQ_41","OQ_42","OQ_43","OQ_44","OQ_45","DASS_1","DASS_2","DASS_3","DASS_4","DASS_5","DASS_6","DASS_7","DASS_8","DASS_9","DASS_10","DASS_11","DASS_12","DASS_13","DASS_14","DASS_15","DASS_16","DASS_17","DASS_18","DASS_19","DASS_20","DASS_21","REQ_1","REQ_2","REQ_3","REQ_4","REQ_5","REQ_6","REQ_7","REQ_8","REQ_9","REQ_10","REQ_11","REQ_12","REQ_13","REQ_14","REQ_15","REQ_16","REQ_17","REQ_18","REQ_19","REQ_20","REQ_21","MEAQ_1","MEAQ_2","MEAQ_3","MEAQ_4","MEAQ_5","MEAQ_6","MEAQ_7","MEAQ_8","MEAQ_9","MEAQ_10","MEAQ_11","MEAQ_12","MEAQ_13","MEAQ_14","MEAQ_15","MEAQ_16","MEAQ_17","MEAQ_18","MEAQ_19","MEAQ_20","MEAQ_21","MEAQ_22","MEAQ_23","MEAQ_24","MEAQ_25","MEAQ_26","MEAQ_27","MEAQ_28","MEAQ_29","MEAQ_30","MEAQ_31","MEAQ_32","MEAQ_33","MEAQ_34","MEAQ_35","MEAQ_36","MEAQ_37","MEAQ_38","MEAQ_39","MEAQ_40","MEAQ_41","MEAQ_42","MEAQ_43","MEAQ_44","MEAQ_45","MEAQ_46","MEAQ_47","MEAQ_48","MEAQ_49","MEAQ_50","MEAQ_51","MEAQ_52","MEAQ_53","MEAQ_54","MEAQ_55","MEAQ_56","MEAQ_57","MEAQ_58","MEAQ_59","MEAQ_60","MEAQ_61","MEAQ_62","EII_1","EII_2","EII_3","EII_4","EII_5","EII_6","EII_7","EII_8","EII_9","EII_10","EII_11","EII_12","EII_13","EII_14","EII_15","EII_16","EII_17","EII_18","EII_19","EII_20","EII_21","EII_22","EII_23","EII_24","EII_25","EII_26","EII_27","MCQ_1","MCQ_2","MCQ_3","MCQ_4","MCQ_5","MCQ_6","MCQ_7","MCQ_8","MCQ_9","MCQ_10","MCQ_11","MCQ_12","MCQ_13","MCQ_14","MCQ_15","MCQ_16","MCQ_17","MCQ_18","MCQ_19","MCQ_20","MCQ_21","MCQ_22","MCQ_23","MCQ_24","MCQ_25","MCQ_26","MCQ_27","MCQ_28","MCQ_29","MCQ_30","CERTS_1","CERTS_2","CERTS_3","CERTS_4","CERTS_5","CERTS_6","CERTS_7","CERTS_8","CERTS_9","CERTS_10","CERTS_11","CERTS_12","CERTS_13","CERTS_14","CERTS_15","CERTS_16","SEP_1","SEP_2","SEP_3","SEP_4","SEP_5","SEP_6","SEP_7","SEP_8","SEP_9","SEP_10","% Car. Id.1","% Car. Id.2","% Car. Id.3","% Car. Id.4","% Car. Id.5","% Car. Id.6","% Car. Id.7","% Car. Id.8","% Car. ~ Id.1","% Car. ~ Id.2","% Car. ~ Id.3","% Car. ~ Id.4","% Car. ~ Id.5","% Car. ~ Id.6","% Car. ~ Id.7","% Car. ~ Id.8","Ecart idéal","Détresse(1)","% Car. Soc 1","% Car. Soc 2","% Car. Soc 3","% Car. Soc 4","% Car. Soc 5","% Car. Soc 6","% Car. Soc 7","% Car. Soc 8","% Car.~ soc1","% Car.~ soc2","% Car.~ soc3","% Car.~ soc4","% Car.~ soc5","% Car.~ soc6","% Car.~ soc7","% Car.~ soc8","Ecart soc","Détresse 2"]
[null,{"$f":"Therapist!R19","v":"MANQUANT"},{"$f":"Therapist!R23","v":"MANQUANT"},{"$f":"Therapist!R27","v":1},{"$f":"'Quest T1'!N7","v":33},{"$f":"'Quest T1'!N10","v":0},{"$f":"'Quest T1'!N13","v":5},{"$f":"'Quest T1'!N16","v":3},{"$f":"'Quest T1'!N19","v":3},{"$f":"Therapist!R30","v":"300.21 "},{"$f":"Therapist!R31","v":5},{"$f":"Therapist!R32","v":"MANQUANT"},{"$f":"Therapist!R33","v":"MANQUANT"},{"$f":"Therapist!R34","v":"MANQUANT"},{"$f":"Therapist!R35","v":"MANQUANT"},{"$f":"#REF!","v":{"$error":"#REF!"}},{"$f":"#REF!","v":{"$error":"#REF!"}},{"$f":"#REF!","v":{"$error":"#REF!"}},{"$f":"#REF!","v":{"$error":"#REF!"}},{"$f":"#REF!","v":{"$error":"#REF!"}},{"$f":"#REF!","v":{"$error":"#REF!"}},{"$f":"#REF!","v":{"$error":"#REF!"}},{"$f":"#REF!","v":{"$error":"#REF!"}},{"$f":"#REF!","v":{"$error":"#REF!"}},{"$f":"#REF!","v":{"$error":"#REF!"}},{"$f":"#REF!","v":{"$error":"#REF!"}},{"$f":"#REF!","v":{"$error":"#REF!"}},{"$f":"#REF!","v":{"$error":"#REF!"}},{"$f":"#REF!","v":{"$error":"#REF!"}},{"$f":"#REF!","v":{"$error":"#REF!"}},{"$f":"#REF!","v":{"$error":"#REF!"}},{"$f":"#REF!","v":{"$error":"#REF!"}},{"$f":"#REF!","v":{"$error":"#REF!"}},{"$f":"#REF!","v":{"$error":"#REF!"}},{"$f":"#REF!","v":{"$error":"#REF!"}},{"$f":"#REF!","v":{"$error":"#REF!"}},{"$f":"#REF!","v":{"$error":"#REF!"}},{"$f":"#REF!","v":{"$error":"#REF!"}},{"$f":"#REF!","v":{"$error":"#REF!"}},{"$f":"#REF!","v":{"$error":"#REF!"}},{"$f":"#REF!","v":{"$error":"#REF!"}},{"$f":"#REF!","v":{"$error":"#REF!"}},{"$f":"#REF!","v":{"$error":"#REF!"}},{"$f":"#REF!","v":{"$error":"#REF!"}},{"$f":"#REF!","v":{"$error":"#REF!"}},{"$f":"#REF!","v":{"$error":"#REF!"}},{"$f":"#REF!","v":{"$error":"#REF!"}},{"$f":"#REF!","v":{"$error":"#REF!"}},{"$f":"#REF!","v":{"$error":"#REF!"}},{"$f":"#REF!","v":{"$error":"#REF!"}},{"$f":"#REF!","v":{"$error":"#REF!"}},{"$f":"#REF!","v":{"$error":"#REF!"}},{"$f":"#REF!","v":{"$error":"#REF!"}},{"$f":"#REF!","v":{"$error":"#REF!"}},{"$f":"#REF!","v":{"$error":"#REF!"}},{"$f":"#REF!","v":{"$error":"#REF!"}},{"$f":"#REF!","v":{"$error":"#REF!"}},{"$f":"#REF!","v":{"$error":"#REF!"}},{"$f":"#REF!","v":{"$error":"#REF!"}},{"$f":"#REF!","v":{"$error":"#REF!"}},{"$f":"DASS!G11","v":2},{"$f":"DASS!G12","v":1},{"$f":"DASS!G13","v":0},{"$f":"DASS!G14","v":0},{"$f":"DASS!G15","v":0},{"$f":"DASS!G16","v":1},{"$f":"DASS!G17","v":0},{"$f":"DASS!G18","v":2},{"$f":"DASS!G19","v":2},{"$f":"DASS!G20","v":0},{"$f":"DASS!G21","v":1},{"$f":"DASS!G22","v":2},{"$f":"DASS!G23","v":1},{"$f":"DASS!G24","v":1},{"$f":"DASS!G25","v":1},{"$f":"DASS!G26","v":0},{"$f":"DASS!G27","v":0},{"$f":"DASS!G28","v":1},{"$f":"DASS!G29","v":1},{"$f":"DASS!G30","v":1},{"$f":"DASS!G31","v":0},{"$f":"REQ!E8","v":3},{"$f":"REQ!E9","v":2},{"$f":"REQ!E10","v":2},{"$f":"REQ!E11","v":3},{"$f":"REQ!E12","v":2},{"$f":"REQ!E13","v":2},{"$f":"REQ!E14","v":4},{"$f":"REQ!E15","v":3},{"$f":"REQ!E16","v":2},{"$f":"REQ!E17","v":1},{"$f":"REQ!E18","v":3},{"$f":"REQ!E19","v":1},{"$f":"REQ!E20","v":2},{"$f":"REQ!E21","v":2},{"$f":"REQ!E22","v":2},{"$f":"REQ!E23","v":3},{"$f":"REQ!E24","v":1},{"$f":"REQ!E25","v":1},{"$f":"REQ!E26","v":1},{"$f":"REQ!E27","v":2},{"$f":"REQ!E28","v":3},{"$f":"MEAQ!H8","v":6},{"$f":"MEAQ!H9","v":6},{"$f":"MEAQ!H10","v":1},{"$f":"MEAQ!H11","v":4},{"$f":"MEAQ!H12","v":2},{"$f":"MEAQ!H13","v":4},{"$f":"MEAQ!H14","v":1},{"$f":"MEAQ!H15","v":2},{"$f":"MEAQ!H16","v":4},{"$f":"MEAQ!H17","v":1},{"$f":"MEAQ!H18","v":2},{"$f":"MEAQ!H19","v":5},{"$f":"MEAQ!H20","v":2},{"$f":"MEAQ!H21","v":2},{"$f":"MEAQ!H22","v":2},{"$f":"MEAQ!H23","v":1},{"$f":"MEAQ!H24","v":2},{"$f":"MEAQ!H25","v":5},{"$f":"MEAQ!H26","v":4},{"$f":"MEAQ!H27","v":6},{"$f":"MEAQ!H28","v":1},{"$f":"MEAQ!H29","v":4},{"$f":"MEAQ!H30","v":4},{"$f":"MEAQ!H31","v":6},{"$f":"MEAQ!H32","v":2},{"$f":"MEAQ!H33","v":3},{"$f":"MEAQ!H34","v":4},{"$f":"MEAQ!H35","v":2},{"$f":"MEAQ!H36","v":1},{"$f":"MEAQ!H37","v":5},{"$f":"MEAQ!H38","v":6},{"$f":"MEAQ!H39","v":2},{"$f":"MEAQ!H40","v":3},{"$f":"MEAQ!H41","v":1},{"$f":"MEAQ!H42","v":1},{"$f":"MEAQ!H43","v":2},{"$f":"MEAQ!H44","v":5},{"$f":"MEAQ!H45","v":5},{"$f":"MEAQ!H46","v":4},{"$f":"MEAQ!H47","v":4},{"$f":"MEAQ!H48","v":3},{"$f":"MEAQ!H49","v":1},{"$f":"MEAQ!H50","v":5},{"$f":"MEAQ!H51","v":2},{"$f":"MEAQ!H52","v":4},{"$f":"MEAQ!H53","v":1},{"$f":"MEAQ!H54","v":1},{"$f":"MEAQ!H55","v":3},{"$f":"MEAQ!H56","v":1},{"$f":"MEAQ!H57","v":2},{"$f":"MEAQ!H58","v":1},{"$f":"MEAQ!H59","v":3},{"$f":"MEAQ!H60","v":4},{"$f":"MEAQ!H61","v":5},{"$f":"MEAQ!H62","v":3},{"$f":"MEAQ!H63","v":1},{"$f":"MEAQ!H64","v":5},{"$f":"MEAQ!H65","v":1},{"$f":"MEAQ!H66","v":2},{"$f":"MEAQ!H67","v":1},{"$f":"MEAQ!H68","v":3},{"$f":"MEAQ!H69","v":6},{"$f":"IUS!H8","v":3},{"$f":"IUS!H9","v":1},{"$f":"IUS!H10","v":2},{"$f":"IUS!H11","v":2},{"$f":"IUS!H12","v":1},{"$f":"IUS!H13","v":1},{"$f":"IUS!H14","v":2},{"$f":"IUS!H15","v":1},{"$f":"IUS!H16","v":1},{"$f":"IUS!H17","v":1},{"$f":"IUS!H18","v":3},{"$f":"IUS!H19","v":1},{"$f":"IUS!H20","v":1},{"$f":"IUS!H21","v":1},{"$f":"IUS!H22","v":1},{"$f":"IUS!H23","v":1},{"$f":"IUS!H24","v":1},{"$f":"IUS!H25","v":2},{"$f":"IUS!H26","v":1},{"$f":"IUS!H27","v":1},{"$f":"IUS!H28","v":1},{"$f":"IUS!H29","v":1},{"$f":"IUS!H30","v":1},{"$f":"IUS!H31","v":1},{"$f":"IUS!H32","v":1},{"$f":"IUS!H33","v":2},{"$f":"IUS!H34","v":1},{"$f":"MCQ!I8","v":3},{"$f":"MCQ!I9","v":2},{"$f":"MCQ!I10","v":1},{"$f":"MCQ!I11","v":2},{"$f":"MCQ!I12","v":1},{"$f":"MCQ!I13","v":4},{"$f":"MCQ!I14","v":2},{"$f":"MCQ!I15","v":1},{"$f":"MCQ!I16","v":4},{"$f":"MCQ!I17","v":2},{"$f":"MCQ!I18","v":4},{"$f":"MCQ!I19","v":1},{"$f":"MCQ!I20","v":2},{"$f":"MCQ!I21","v":4},{"$f":"MCQ!I22","v":2},{"$f":"MCQ!I23","v":1},{"$f":"MCQ!I24","v":4},{"$f":"MCQ!I25","v":2},{"$f":"MCQ!I26","v":1},{"$f":"MCQ!I27","v":2},{"$f":"MCQ!I28","v":1},{"$f":"MCQ!I29","v":3},{"$f":"MCQ!I30","v":1},{"$f":"MCQ!I31","v":1},{"$f":"MCQ!I32","v":1},{"$f":"MCQ!I33","v":4},{"$f":"MCQ!I34","v":4},{"$f":"MCQ!I35","v":2},{"$f":"MCQ!I36","v":1},{"$f":"MCQ!I37","v":1},{"$f":"CERTS!J6","v":3},{"$f":"CERTS!J7","v":3},{"$f":"CERTS!J8","v":4},{"$f":"CERTS!J9","v":2},{"$f":"CERTS!J10","v":3},{"$f":"CERTS!J11","v":2},{"$f":"CERTS!J12","v":1},{"$f":"CERTS!J13","v":1},{"$f":"CERTS!J14","v":2},{"$f":"CERTS!J15","v":2},{"$f":"CERTS!J16","v":3},{"$f":"CERTS!J17","v":4},{"$f":"CERTS!J18","v":1},{"$f":"CERTS!J19","v":3},{"$f":"CERTS!J20","v":4},{"$f":"CERTS!J21","v":2},{"$f":"SE!C5","v":25},{"$f":"SE!C6","v":75},{"$f":"SE!C7","v":60},{"$f":"SE!C8","v":60},{"$f":"SE!C9","v":80},{"$f":"SE!C10","v":50},{"$f":"SE!C11","v":75},{"$f":"SE!C12","v":20},{"$f":"SE!C13","v":10},{"$f":"SE!C14","v":20},{"$f":"'Self-Discr'!D6","v":0.3},{"$f":"'Self-Discr'!D7","v":0.4},{"$f":"'Self-Discr'!D8","v":0.5},{"$f":"'Self-Discr'!D9","v":" "},{"$f":"'Self-Discr'!D10","v":" "},{"$f":"'Self-Discr'!D11","v":" "},{"$f":"'Self-Discr'!D12","v":" "},{"$f":"'Self-Discr'!D13","v":" "},{"$f":"'Self-Discr'!H6","v":0.1},{"$f":"'Self-Discr'!H7","v":" "},{"$f":"'Self-Discr'!H8","v":0.05},{"$f":"'Self-Discr'!H9","v":" "},{"$f":"'Self-Discr'!H10","v":" "},{"$f":"'Self-Discr'!H11","v":" "},{"$f":"'Self-Discr'!H12","v":" "},{"$f":"'Self-Discr'!H13","v":" "},{"$f":"'Self-Discr'!C39","v":6},{"$f":"'Self-Discr'!C40","v":4},{"$f":"'Self-Discr'!D19","v":0.3},{"$f":"'Self-Discr'!D20","v":0.9},{"$f":"'Self-Discr'!D21","v":0.5},{"$f":"'Self-Discr'!D22","v":" "},{"$f":"'Self-Discr'!D23","v":" "},{"$f":"'Self-Discr'!D24","v":" "},{"$f":"'Self-Discr'!D25","v":" "},{"$f":"'Self-Discr'!D26","v":" "},{"$f":"'Self-Discr'!H19","v":0.1},{"$f":"'Self-Discr'!H20","v":0.05},{"$f":"'Self-Discr'!H21","v":0.2},{"$f":"'Self-Discr'!H22","v":" "},{"$f":"'Self-Discr'!H23","v":" "},{"$f":"'Self-Discr'!H24","v":" "},{"$f":"'Self-Discr'!H25","v":" "},{"$f":"'Self-Discr'!H26","v":" "},{"$f":"'Self-Discr'!C41","v":5},{"$f":"'Self-Discr'!C42","v":5},{"$f":"#REF!","v":{"$error":"#REF!"}},{"$f":"#REF!","v":{"$error":"#REF!"}},{"$f":"#REF!","v":{"$error":"#REF!"}},{"$f":"#REF!","v":{"$error":"#REF!"}},{"$f":"#REF!","v":{"$error":"#REF!"}},{"$f":"#REF!","v":{"$error":"#REF!"}},{"$f":"#REF!","v":{"$error":"#REF!"}},{"$f":"#REF!","v":{"$error":"#REF!"}},{"$f":"#REF!","v":{"$error":"#REF!"}},{"$f":"#REF!","v":{"$error":"#REF!"}},{"$f":"#REF!","v":{"$error":"#REF!"}},{"$f":"#REF!","v":{"$error":"#REF!"}},{"$f":"#REF!","v":{"$error":"#REF!"}},{"$f":"#REF!","v":{"$error":"#REF!"}},{"$f":"#REF!","v":{"$error":"#REF!"}},{"$f":"#REF!","v":{"$error":"#REF!"}},{"$f":"#REF!","v":{"$error":"#REF!"}},{"$f":"#REF!","v":{"$error":"#REF!"}},{"$f":"#REF!","v":{"$error":"#REF!"}},{"$f":"#REF!","v":{"$error":"#REF!"}},{"$f":"#REF!","v":{"$error":"#REF!"}},{"$f":"#REF!","v":{"$error":"#REF!"}},{"$f":"#REF!","v":{"$error":"#REF!"}},{"$f":"#REF!","v":{"$error":"#REF!"}},{"$f":"#REF!","v":{"$error":"#REF!"}},{"$f":"#REF!","v":{"$error":"#REF!"}},{"$f":"#REF!","v":{"$error":"#REF!"}},{"$f":"#REF!","v":{"$error":"#REF!"}},{"$f":"#REF!","v":{"$error":"#REF!"}},{"$f":"#REF!","v":{"$error":"#REF!"}},{"$f":"#REF!","v":{"$error":"#REF!"}},{"$f":"#REF!","v":{"$error":"#REF!"}},{"$f":"#REF!","v":{"$error":"#REF!"}},{"$f":"#REF!","v":{"$error":"#REF!"}},{"$f":"#REF!","v":{"$error":"#REF!"}},{"$f":"#REF!","v":{"$error":"#REF!"}},{"$f":"#REF!","v":{"$error":"#REF!"}},{"$f":"#REF!","v":{"$error":"#REF!"}},{"$f":"#REF!","v":{"$error":"#REF!"}},{"$f":"#REF!","v":{"$error":"#REF!"}},{"$f":"#REF!","v":{"$error":"#REF!"}},{"$f":"#REF!","v":{"$error":"#REF!"}},{"$f":"#REF!","v":{"$error":"#REF!"}},{"$f":"#REF!","v":{"$error":"#REF!"}},{"$f":"#REF!","v":{"$error":"#REF!"}},{"$f":"DASS!H11","v":1},{"$f":"DASS!H12","v":0},{"$f":"DASS!H13","v":0},{"$f":"DASS!H14","v":0},{"$f":"DASS!H15","v":0},{"$f":"DASS!H16","v":1},{"$f":"DASS!H17","v":0},{"$f":"DASS!H18","v":1},{"$f":"DASS!H19","v":2},{"$f":"DASS!H20","v":0},{"$f":"DASS!H21","v":1},{"$f":"DASS!H22","v":1},{"$f":"DASS!H23","v":1},{"$f":"DASS!H24","v":0},{"$f":"DASS!H25","v":1},{"$f":"DASS!H26","v":0},{"$f":"DASS!H27","v":0},{"$f":"DASS!H28","v":1},{"$f":"DASS!H29","v":0},{"$f":"DASS!H30","v":1},{"$f":"DASS!H31","v":0},{"$f":"REQ!F8","v":3},{"$f":"REQ!F9","v":2},{"$f":"REQ!F10","v":1},{"$f":"REQ!F11","v":4},{"$f":"REQ!F12","v":1},{"$f":"REQ!F13","v":1},{"$f":"REQ!F14","v":3},{"$f":"REQ!F15","v":3},{"$f":"REQ!F16","v":2},{"$f":"REQ!F17","v":1},{"$f":"REQ!F18","v":2},{"$f":"REQ!F19","v":2},{"$f":"REQ!F20","v":1},{"$f":"REQ!F21","v":1},{"$f":"REQ!F22","v":2},{"$f":"REQ!F23","v":3},{"$f":"REQ!F24","v":1},{"$f":"REQ!F25","v":1},{"$f":"REQ!F26","v":1},{"$f":"REQ!F27","v":2},{"$f":"REQ!F28","v":3},{"$f":"MEAQ!I8","v":2},{"$f":"MEAQ!I9","v":5},{"$f":"MEAQ!I10","v":1},{"$f":"MEAQ!I11","v":2},{"$f":"MEAQ!I12","v":1},{"$f":"MEAQ!I13","v":5},{"$f":"MEAQ!I14","v":1},{"$f":"MEAQ!I15","v":2},{"$f":"MEAQ!I16","v":2},{"$f":"MEAQ!I17","v":1},{"$f":"MEAQ!I18","v":2},{"$f":"MEAQ!I19","v":5},{"$f":"MEAQ!I20","v":4},{"$f":"MEAQ!I21","v":3},{"$f":"MEAQ!I22","v":2},{"$f":"MEAQ!I23","v":1},{"$f":"MEAQ!I24","v":2},{"$f":"MEAQ!I25","v":3},{"$f":"MEAQ!I26","v":4},{"$f":"MEAQ!I27","v":3},{"$f":"MEAQ!I28","v":1},{"$f":"MEAQ!I29","v":2},{"$f":"MEAQ!I30","v":2},{"$f":"MEAQ!I31","v":4},{"$f":"MEAQ!I32","v":1},{"$f":"MEAQ!I33","v":1},{"$f":"MEAQ!I34","v":3},{"$f":"MEAQ!I35","v":1},{"$f":"MEAQ!I36","v":1},{"$f":"MEAQ!I37","v":4},{"$f":"MEAQ!I38","v":5},{"$f":"MEAQ!I39","v":2},{"$f":"MEAQ!I40","v":2},{"$f":"MEAQ!I41","v":2},{"$f":"MEAQ!I42","v":1},{"$f":"MEAQ!I43","v":2},{"$f":"MEAQ!I44","v":5},{"$f":"MEAQ!I45","v":5},{"$f":"MEAQ!I46","v":2},{"$f":"MEAQ!I47","v":2},{"$f":"MEAQ!I48","v":4},{"$f":"MEAQ!I49","v":1},{"$f":"MEAQ!I50","v":2},{"$f":"MEAQ!I51","v":2},{"$f":"MEAQ!I52","v":3},{"$f":"MEAQ!I53","v":1},{"$f":"MEAQ!I54","v":1},{"$f":"MEAQ!I55","v":4},{"$f":"MEAQ!I56","v":1},{"$f":"MEAQ!I57","v":3},{"$f":"MEAQ!I58","v":1},{"$f":"MEAQ!I59","v":2},{"$f":"MEAQ!I60","v":4},{"$f":"MEAQ!I61","v":4},{"$f":"MEAQ!I62","v":3},{"$f":"MEAQ!I63","v":1},{"$f":"MEAQ!I64","v":6},{"$f":"MEAQ!I65","v":1},{"$f":"MEAQ!I66","v":1},{"$f":"MEAQ!I67","v":1},{"$f":"MEAQ!I68","v":2},{"$f":"MEAQ!I69","v":6},{"$f":"IUS!I8","v":3},{"$f":"IUS!I9","v":1},{"$f":"IUS!I10","v":1},{"$f":"IUS!I11","v":1},{"$f":"IUS!I12","v":1},{"$f":"IUS!I13","v":1},{"$f":"IUS!I14","v":1},{"$f":"IUS!I15","v":1},{"$f":"IUS!I16","v":1},{"$f":"IUS!I17","v":1},{"$f":"IUS!I18","v":4},{"$f":"IUS!I19","v":1},{"$f":"IUS!I20","v":1},{"$f":"IUS!I21","v":1},{"$f":"IUS!I22","v":1},{"$f":"IUS!I23","v":1},{"$f":"IUS!I24","v":1},{"$f":"IUS!I25","v":1},{"$f":"IUS!I26","v":2},{"$f":"IUS!I27","v":1},{"$f":"IUS!I28","v":2},{"$f":"IUS!I29","v":1},{"$f":"IUS!I30","v":1},{"$f":"IUS!I31","v":1},{"$f":"IUS!I32","v":1},{"$f":"IUS!I33","v":1},{"$f":"IUS!I34","v":2},{"$f":"MCQ!J8","v":2},{"$f":"MCQ!J9","v":2},{"$f":"MCQ!J10","v":1},{"$f":"MCQ!J11","v":2},{"$f":"MCQ!J12","v":1},{"$f":"MCQ!J13","v":3},{"$f":"MCQ!J14","v":2},{"$f":"MCQ!J15","v":3},{"$f":"MCQ!J16","v":2},{"$f":"MCQ!J17","v":2},{"$f":"MCQ!J18","v":2},{"$f":"MCQ!J19","v":1},{"$f":"MCQ!J20","v":1},{"$f":"MCQ!J21","v":2},{"$f":"MCQ!J22","v":1},{"$f":"MCQ!J23","v":2},{"$f":"MCQ!J24","v":1},{"$f":"MCQ!J25","v":2},{"$f":"MCQ!J26","v":2},{"$f":"MCQ!J27","v":1},{"$f":"MCQ!J28","v":1},{"$f":"MCQ!J29","v":1},{"$f":"MCQ!J30","v":2},{"$f":"MCQ!J31","v":1},{"$f":"MCQ!J32","v":1},{"$f":"MCQ!J33","v":2},{"$f":"MCQ!J34","v":2},{"$f":"MCQ!J35","v":2},{"$f":"MCQ!J36","v":1},{"$f":"MCQ!J37","v":1},{"$f":"CERTS!K6","v":2},{"$f":"CERTS!K7","v":2},{"$f":"CERTS!K8","v":3},{"$f":"CERTS!K9","v":1},{"$f":"CERTS!K10","v":4},{"$f":"CERTS!K11","v":2},{"$f":"CERTS!K12","v":2},{"$f":"CERTS!K13","v":2},{"$f":"CERTS!K14","v":2},{"$f":"CERTS!K15","v":1},{"$f":"CERTS!K16","v":3},{"$f":"CERTS!K17","v":3},{"$f":"CERTS!K18","v":2},{"$f":"CERTS!K19","v":2},{"$f":"CERTS!K20","v":3},{"$f":"CERTS!K21","v":2},{"$f":"SE!D5","v":20},{"$f":"SE!D6","v":75},{"$f":"SE!D7","v":60},{"$f":"SE!D8","v":60},{"$f":"SE!D9","v":85},{"$f":"SE!D10","v":75},{"$f":"SE!D11","v":65},{"$f":"SE!D12","v":10},{"$f":"SE!D13","v":20},{"$f":"SE!D14","v":85},{"$f":"'Self-Discr'!L6","v":0.25},{"$f":"'Self-Discr'!L7","v":0.35},{"$f":"'Self-Discr'!L8","v":0.5},{"$f":"'Self-Discr'!L9","v":0.4},{"$f":"'Self-Discr'!L10","v":0.7},{"$f":"'Self-Discr'!L11","v":" "},{"$f":"'Self-Discr'!L12","v":" "},{"$f":"'Self-Discr'!L13","v":" "},{"$f":"'Self-Discr'!P6","v":0.1},{"$f":"'Self-Discr'!P7","v":0.01},{"$f":"'Self-Discr'!P8","v":0.1},{"$f":"'Self-Discr'!P9","v":0.4},{"$f":"'Self-Discr'!P10","v":0.1},{"$f":"'Self-Discr'!P11","v":" "},{"$f":"'Self-Discr'!P12","v":" "},{"$f":"'Self-Discr'!P13","v":" "},{"$f":"'Self-Discr'!E39","v":4},{"$f":"'Self-Discr'!E40","v":3},{"$f":"'Self-Discr'!L19","v":0.3},{"$f":"'Self-Discr'!L20","v":0.8},{"$f":"'Self-Discr'!L21","v":0.4},{"$f":"'Self-Discr'!L22","v":0.6},{"$f":"'Self-Discr'!L23","v":0.5},{"$f":"'Self-Discr'!L24","v":" "},{"$f":"'Self-Discr'!L25","v":" "},{"$f":"'Self-Discr'!L26","v":" "},{"$f":"'Self-Discr'!P19","v":0.05},{"$f":"'Self-Discr'!P20","v":0.15},{"$f":"'Self-Discr'!P21","v":0.1},{"$f":"'Self-Discr'!P22","v":0.2},{"$f":"'Self-Discr'!P23","v":0.7},{"$f":"'Self-Discr'!P24","v":" "},{"$f":"'Self-Discr'!P25","v":" "},{"$f":"'Self-Discr'!P26","v":" "},{"$f":"'Self-Discr'!E41","v":5},{"$f":"'Self-Discr'!E42","v":4}]

{"sheet":"Quest T1","index":1,"n_rows":290,"n_cols":21,"rows_kept":290,"cut":false,"hidden":false,"merged":[[5,2,5,5],[1,1,2,7],[3,1,3,7],[289,1,289,7],[6,2,6,3],[6,4,6,5],[8,2,8,5],[11,2,11,5],[14,2,14,5],[17,2,17,5],[281,1,281,7],[282,1,282,7],[286,1,286,7],[279,7,279,8],[246,1,246,8],[247,1,247,8],[268,1,268,8],[252,1,252,5],[253,1,253,5],[273,1,273,5],[274,1,274,5],[272,1,272,5],[275,1,275,5],[276,1,276,5],[277,1,277,5],[278,1,278,5],[279,1,279,6],[265,1,265,7],[269,1,269,8],[270,1,270,5],[271,1,271,5],[259,1,259,6],[259,7,259,8],[261,1,261,7],[262,1,262,7],[250,1,250,5],[251,1,251,5],[254,1,254,5],[256,1,256,5],[257,1,257,5],[258,1,258,5],[255,1,255,5],[248,1,248,7],[249,1,249,8],[239,1,239,6],[240,1,240,6],[241,2,241,6],[242,2,242,6],[243,2,243,6],[229,1,229,6],[230,1,230,6],[231,1,231,6],[232,1,232,6],[233,1,233,6],[234,1,234,6],[235,1,235,6],[236,1,236,6],[237,1,237,6],[238,1,238,6],[228,1,228,7],[222,1,222,6],[204,1,204,7],[225,1,225,7],[226,1,226,7],[227,1,227,7],[216,1,216,6],[217,1,217,6],[218,1,218,6],[219,1,219,6],[220,1,220,6],[221,1,221,6],[205,1,205,7],[206,1,206,7],[207,1,207,6],[208,1,208,6],[212,1,212,6],[213,1,213,6],[214,1,214,6],[215,1,215,6],[170,1,170,7],[209,1,209,6],[210,1,210,6],[211,1,211,6],[198,2,198,6],[199,2,199,6],[200,2,200,6],[201,2,201,6],[171,1,171,7],[186,2,186,6],[187,2,187,6],[188,2,188,6],[189,2,189,6],[190,2,190,6],[191,2,191,6],[172,2,172,6],[173,2,173,6],[174,2,174,6],[175,2,175,6],[176,2,176,6],[177,2,177,6],[178,2,178,6],[179,2,179,6],[194,2,194,6],[195,2,195,6],[196,2,196,6],[197,2,197,6],[192,2,192,6],[193,2,193,6],[182,2,182,6],[183,2,183,6],[184,2,184,6],[185,2,185,6],[180,2,180,6],[181,2,181,6],[140,1,140,7],[139,1,139,7],[165,1,165,6],[166,1,166,6],[167,1,167,6],[154,1,154,6],[155,1,155,6],[156,1,156,6],[157,1,157,6],[158,1,158,6],[159,1,159,6],[141,1,141,6],[142,1,142,6],[143,1,143,6],[144,1,144,6],[145,1,145,6],[146,1,146,6],[147,1,147,6],[148,1,148,6],[149,1,149,6],[161,1,161,6],[162,1,162,6],[163,1,163,6],[164,1,164,6],[160,1,160,6],[150,1,150,6],[151,1,151,6],[152,1,152,6],[153,1,153,6],[135,1,135,6],[136,1,136,6],[84,1,84,6],[85,1,85,6],[86,1,86,6],[73,1,73,7],[74,1,74,7],[127,1,127,6],[128,1,128,6],[129,1,129,6],[130,1,130,6],[115,1,115,6],[116,1,116,6],[117,1,117,6],[118,1,118,6],[119,1,119,6],[120,1,120,6],[103,1,103,6],[104,1,104,6],[105,1,105,6],[106,1,106,6],[107,1,107,6],[108,1,108,6],[91,1,91,6],[92,1,92,6],[93,1,93,6],[75,1,75,6],[76,1,76,6],[77,1,77,6],[78,1,78,6],[79,1,79,6],[80,1,80,6],[81,1,81,6],[82,1,82,6],[83,1,83,6],[133,1,133,6],[134,1,134,6],[123,1,123,6],[124,1,124,6],[125,1,125,6],[126,1,126,6],[121,1,121,6],[122,1,122,6],[111,1,111,6],[112,1,112,6],[113,1,113,6],[114,1,114,6],[131,1,131,6],[132,1,132,6],[109,1,109,6],[110,1,110,6],[99,1,99,6],[100,1,100,6],[101,1,101,6],[102,1,102,6],[97,1,97,6],[98,1,98,6],[87,1,87,6],[88,1,88,6],[89,1,89,6],[90,1,90,6],[95,1,95,6],[96,1,96,6],[94,1,94,6],[68,1,68,6],[69,1,69,6],[70,1,70,6],[49,1,49,7],[48,1,48,7],[61,1,61,6],[62,1,62,6],[63,1,63,6],[64,1,64,6],[65,1,65,6],[66,1,66,6],[50,1,50,6],[51,1,51,6],[52,1,52,6],[53,1,53,6],[54,1,54,6],[55,1,55,6],[56,1,56,6],[67,1,67,6],[57,1,57,6],[58,1,58,6],[59,1,59,6],[60,1,60,6],[23,1,23,7],[42,2,42,6],[43,2,43,6],[44,2,44,6],[45,2,45,6],[24,1,24,7],[36,2,36,6],[37,2,37,6],[38,2,38,6],[39,2,39,6],[40,2,40,6],[41,2,41,6],[30,2,30,6],[31,2,31,6],[32,2,32,6],[33,2,33,6],[34,2,34,6],[35,2,35,6],[25,2,25,6],[26,2,26,6],[27,2,27,6],[28,2,28,6],[29,2,29,6]]}
[null,null,null,null,null,null,null,null,null,null,null,null,null,"Réponse"]
[null,"PROCESSES ASSESMENT PROTOCOL - T1"]
[]
[null,"This page contains several questionnaires that measure psychological processes. Those questionnaires don't aim at assessing categorical diagnosis but intend to measure your way of functionning. Please answer those questions the most sincerely. In answering those questionnaires, you give your informed consent that your data may me used for research purpose. The data will be treated anonymously."]
[null,null,null,null,null,null,null,null,null,null,null,null,null,null,null,"Please select",null,null,"Please select"]
[null,null,null,null,null,null,null,null,null,null,null,null,null,null,null,"Female",0,null,"Single ",1]
[null,{"$f":"IF(E7=1,1,0)","v":0},"Age",null,34,null,null,null,null,null,null,null,null,{"$f":"IF(E7=1,\"MISSING\",E7- 1)","v":33},null,"Male",1,null,"Cohabitation– in a couple",2]
[null,null,null,null,null,null,null,null,null,null,null,null,null,null,null,null,null,null,"Married",3]
[null,null,"Sex",null,null,null,null,null,null,null,null,null,null,null,null,"Please select",null,null,"Separated ",4]
[null,{"$f":"IF(C10=1,1,0)","v":0},2,null,null,null,null,null,null,null,null,null,null,{"$f":"IF(C10=1,\"MISSING\",C10- 2)","v":0},null,"Elementary school degree",1,null,"Divorced",5]
[null,null,null,null,null,null,null,null,null,null,null,null,null,null,null,"Middle school degree",2,null,"Widowed",6]
[null,null,"Education",null,null,null,null,null,null,null,null,null,null,null,null,"High school degree",3]
[null,{"$f":"IF(C13=1,1,0)","v":0},6,null,null,null,null,null,null,null,null,null,null,{"$f":"IF(C13=1,\"MISSING\",C13- 1)","v":5},null,"College degree",4,null,"Please select"]
[null,null,null,null,null,null,null,null,null,null,null,null,null,null,null,"University degree",5,null,"Unemployed",1]
[null,null,"Employment status",null,null,null,null,null,null,null,null,null,null,null,null,null,null,null,"Worker ",2]
[null,{"$f":"IF(C16=1,1,0)","v":0},4,null,null,null,null,null,null,null,null,null,null,{"$f":"IF(C16=1,\"MISSING\",C16- 1)","v":3},null,null,null,null,"Employee",3]
[null,null,null,null,null,null,null,null,null,null,null,null,null,null,null,null,null,null,"Executive",4]
[null,null,"Family status",null,null,null,null,null,null,null,null,null,null,null,null,null,null,null,"Freelancer",5]
[null,{"$f":"IF(C19=1,1,0)","v":0},4,null,null,null,null,null,null,null,null,null,null,{"$f":"IF(C19=1,\"MISSING\",C19- 1)","v":3},null,null,null,null,"Liberal Profession",6]
[null,null,null,null,null,null,null,null,null,null,null,null,null,null,null,null,null,null,"Student",7]
[]
[]
[]
[null,"DASS-21"]
[null,"Please read each statement and circle a number 0, 1, 2 or 3 which indicates how much the statement applied to you over the past week.  There are no right or wrong answers.  Do not spend too much time on any statement.  "]
[{"$f":"IF(H26=1,1,0)","v":0},1,"I found it hard to wind down.",null,null,null,null,4,null,null,null,null,null,{"$f":"IF(H26=1,\"MISSING\", H26-2)","v":2},null,"Please select",null,null,null,null,"Please select"]
[{"$f":"IF(H27=1,1,0)","v":0},2,"I was aware of dryness of my mouth.",null,null,null,null,3,null,null,null,null,null,1,null,"0  Did not apply to me at all",null,null,null,null,1]
[0,3,"I couldn’t seem to experience any positive feeling at all.",null,null,null,null,2,null,null,null,null,null,0,null,"1  Applied to me to some degree, or some of the time",null,null,null,null,2]
[0,4,"I experienced breathing difficulty (eg, excessively rapid breathing, Breathlessness in the absence of physical exertion).",null,null,null,null,2,null,null,null,null,null,0,null,"2  Applied to me to a considerable degree, or a good part of time",null,null,null,null,3]
[0,5,"I found it difficult to work up the initiative to do things.",null,null,null,null,2,null,null,null,null,null,0,null,"3  Applied to me very much, or most of the time",null,null,null,null,4]
[0,6,"I tended to over-react to situations.",null,null,null,null,3,null,null,null,null,null,1,null,null,null,null,null,null,5]
[0,7,"I experienced trembling (e.g., in the hands).",null,null,null,null,2,null,null,null,null,null,0,null,null,null,null,null,null,6]
[0,8,"I felt that I was using a lot of nervous energy.",null,null,null,null,4,null,null,null,null,null,2,null,null,null,null,null,null,7]
[0,9,"I was worried about situations in which I might panic and make a fool of myself.",null,null,null,null,4,null,null,null,null,null,2,null,null,null,null,null,null,8]
[0,10,"I felt that I had nothing to look forward to.",null,null,null,null,2,null,null,null,null,null,0,null,null,null,null,null,null,9]
[0,11,"I found myself getting agitated.",null,null,null,null,3,null,null,null,null,null,1,null,null,null,null,null,null,10]
[0,12,"I found it difficult to relax.",null,null,null,null,4,null,null,null,null,null,2,null,null,null,null,null,null,11]
[0,13,"I felt down-hearted and blue.",null,null,null,null,3,null,null,null,null,null,1,null,null,null,null,null,null,12]
[0,14,"I was intolerant of anything that kept me from getting on with what I was doing.",null,null,null,null,3,null,null,null,null,null,1,null,null,null,null,null,null,13]
[0,15,"I felt I was close to panic.",null,null,null,null,3,null,null,null,null,null,1,null,null,null,null,null,null,14]
[0,16,"I was unable to become enthusiastic about anything.",null,null,null,null,2,null,null,null,null,null,0,null,null,null,null,null,null,15]
[0,17,"I felt I wasn’t worth much as a person.",null,null,null,null,2,null,null,null,null,null,0,null,null,null,null,null,null,16]
[0,18,"I felt that I was rather touchy.",null,null,null,null,3,null,null,null,null,null,1,null,null,null,null,null,null,17]
[0,19,"I was aware of the action of my heart in the absence of physical exertion (e.g. sense of heart increase, heart missing a beat).",null,null,null,null,3,null,null,null,null,null,1,null,null,null,null,null,null,18]
[0,20,"I felt scared without any good reason.",null,null,null,null,3,null,null,null,null,null,1,null,null,null,null,null,null,19]
[0,21,"I felt that life was meaningless.",null,null,null,null,2,null,null,null,null,null,0,null,null,null,null,null,null,20]
[null,null,null,null,null,null,null,null,null,null,null,null,null,null,null,null,null,null,null,null,21]
[null,null,null,null,null,null,null,null,null,null,null,null,null,null,null,null,null,null,null,null,22]
[null,"REQ-21",null,null,null,null,null,null,null,null,null,null,null,null,null,null,null,null,null,null,23]
[null,"We all experience many different feelings or emotions. For example, different things in our lives make us happy, sad, angry, etc.\nThe following questionnaire asks you about how often you do certain things in response to your emotions. You do not have to think about specific emotions but just how often you generally do the things listed below.\nPlease tick the box corresponding to the answer that fits best. We all respond to our emotions in different ways so there are no right or wrong answers.\n",null,null,null,null,null,null,null,null,null,null,null,null,null,null,null,null,null,null,24]
[{"$f":"IF(H51=1,1,0)","v":0},"1.      I talk to someone about how I feel",null,null,null,null,null,4,null,null,null,null,null,{"$f":"IF(H51=1,\"MISSING\", H51-1)","v":3},null,"Please select",null,null,null,null,25]
[0,"2.      I take my feelings out on others verbally (e.g., shouting, arguing). ",null,null,null,null,null,3,null,null,null,null,null,2,null,"Never",1,null,null,null,26]
[0,"3.      I seek physical contact from friends of family (e.g., a hug, hold hands).",null,null,null,null,null,3,null,null,null,null,null,2,null,"Seldom",2,null,null,null,27]
[0,"4.      I reviews (rethink) my thoughts or beliefs.",null,null,null,null,null,4,null,null,null,null,null,3,null,"Often",3,null,null,null,28]
[0,"5.      I harm or punish myself in some way.",null,null,null,null,null,3,null,null,null,null,null,2,null,"Very often",4,null,null,null,29]
[0,"6.      I do something energetic (e.g., play sport, go for a walk).",null,null,null,null,null,3,null,null,null,null,null,2,null,"Always",5,null,null,null,30]
[0,"7.      I dwell on my thoughts and feelings (e.g., It goes round and round in my head and I can’t stop it).",null,null,null,null,null,5,null,null,null,null,null,4,null,null,null,null,null,null,31]
[0,"8.      I ask others for advice.",null,null,null,null,null,4,null,null,null,null,null,3,null,null,null,null,null,null,32]
[0,"9.      I review (rethink) my goals or plans. ",null,null,null,null,null,3,null,null,null,null,null,2,null,null,null,null,null,null,33]
[0,"10.  I take my feelings out on others physically (e.g., fighting, lashing out). ",null,null,null,null,null,2,null,null,null,null,null,1,null,null,null,null,null,null,34]
[0,"11.  I put the situation into perspective.",null,null,null,null,null,4,null,null,null,null,null,3,null,null,null,null,null,null,35]
[0,"12.  I concentrate on a pleasant activity. ",null,null,null,null,null,2,null,null,null,null,null,1,null,null,null,null,null,null,36]
[0,"13.  I try to make others feel bad (e.g., being rude, ignoring them). ",null,null,null,null,null,3,null,null,null,null,null,2,null,null,null,null,null,null,37]
[0,"14.  I think about people better off and make myself feel worse.",null,null,null,null,null,3,null,null,null,null,null,2,null,null,null,null,null,null,38]
[0,"15.  I keep the feeling locked up inside. ",null,null,null,null,null,3,null,null,null,null,null,2,null,null,null,null,null,null,39]
[0,"16.  I plan what I could do better next time.",null,null,null,null,null,4,null,null,null,null,null,3,null,null,null,null,null,null,40]
[0,"17.  I bully other people (e.g. saying nasty things to them, hitting them)",null,null,null,null,null,2,null,null,null,null,null,1,null,null,null,null,null,null,41]
[0,"18.  I take my feelings out on objects around me (e.g., deliberately causing damage to my house, school or outdoor things). ",null,null,null,null,null,2,null,null,null,null,null,1,null,null,null,null,null,null,42]
[0,"19.  Things feel unreal (e.g., I feel strange, things around me feel strange, I daydream).",null,null,null,null,null,2,null,null,null,null,null,1,null,null,null,null,null,null,43]
[0,"20.  I telephone friends or family. ",null,null,null,null,null,3,null,null,null,null,null,2,null,null,null,null,null,null,44]
[0,"21.  I go out and do something nice (e.g., cinema, shopping, go for a meal, meet people). ",null,null,null,null,null,4,null,null,null,null,null,3,null,null,null,null,null,null,45]
[null,null,null,null,null,null,null,null,null,null,null,null,null,null,null,null,null,null,null,null,46]
[null,null,null,null,null,null,null,null,null,null,null,null,null,null,null,null,null,null,null,null,47]
[null,"MEAQ",null,null,null,null,null,null,null,null,null,null,null,null,null,null,null,null,null,null,48]
[null,"Please indicate the extent to which you agree or disagree with each of the following statements",null,null,null,null,null,null,null,null,null,null,null,null,null,null,null,null,null,null,49]
[{"$f":"IF(H76=1,1,0)","v":0},"1-I won’t do something if I think it will make me uncomfortable.",null,null,null,null,null,7,null,null,null,null,null,{"$f":"IF(H76=1,\"MISSING\", H76-1)","v":6},null,"Please select",null,null,null,null,50]
[0,"2-If I could magically remove all of my painful memories, I would. ",null,null,null,null,null,7,null,null,null,null,null,6,null,"1 Strongly disagree ",1,null,null,null,51]
[0,"3-When something upsetting comes up, I try very hard to stop thinking about it. ",null,null,null,null,null,2,null,null,null,null,null,1,null,"2 Moderately  disagree ",2,null,null,null,52]
[0,"4-I sometimes have difficulty identifying how I feel.",null,null,null,null,null,5,null,null,null,null,null,4,null,"3 Slightly disagree ",3,null,null,null,53]
[0,"5-I tend to put off unpleasant things that need to get done. ",null,null,null,null,null,3,null,null,null,null,null,2,null,"4 Slightly agree ",4,null,null,null,54]
[0,"6-People should face their fears.",null,null,null,null,null,5,null,null,null,null,null,4,null,"5 Moderatly agree ",5,null,null,null,55]
[0,"7-Happiness means never feeling any pain or disappointment. ",null,null,null,null,null,2,null,null,null,null,null,1,null,"6 Strongly agree ",6,null,null,null,56]
[0,"8-I avoid activities if there is even a small possibility of getting hurt.",null,null,null,null,null,3,null,null,null,null,null,2,null,null,null,null,null,null,57]
[0,"9-When negative thoughts come up, I try to fill my head with something else.",null,null,null,null,null,5,null,null,null,null,null,4,null,null,null,null,null,null,58]
[0,"10-At times, people have told me I’m in denial.",null,null,null,null,null,2,null,null,null,null,null,1,null,null,null,null,null,null,59]
[0,"11-I sometimes procrastinate to avoid facing challenges.",null,null,null,null,null,3,null,null,null,null,null,2,null,null,null,null,null,null,60]
[0,"12-Even when I feel uncomfortable, I don’t give up working toward things I value. ",null,null,null,null,null,6,null,null,null,null,null,5,null,null,null,null,null,null,61]
[0,"13-When I am hurting, I would do anything to feel better.",null,null,null,null,null,3,null,null,null,null,null,2,null,null,null,null,null,null,62]
[0,"14-I rarely do something if there is a chance that it will upset me. ",null,null,null,null,null,3,null,null,null,null,null,2,null,null,null,null,null,null,63]
[0,"15-I usually try to distract myself when I feel something painful. ",null,null,null,null,null,3,null,null,null,null,null,2,null,null,null,null,null,null,64]
[0,"16-I am able to « turn off » my emotions when I don’t want to feel.  ",null,null,null,null,null,2,null,null,null,null,null,1,null,null,null,null,null,null,65]
[0,"17-When I have something important to do I find myself doing a lot of other things instead. ",null,null,null,null,null,3,null,null,null,null,null,2,null,null,null,null,null,null,66]
[0,"18-I am willing to put up with pain and discomfort to get what I want. ",null,null,null,null,null,6,null,null,null,null,null,5,null,null,null,null,null,null,67]
[0,"19-Happiness involves getting rid of negative thoughts. ",null,null,null,null,null,5,null,null,null,null,null,4,null,null,null,null,null,null,68]
[0,"20-I work hard to avoid situations that might bring up unpleasant thoughts and feelings in me. ",null,null,null,null,null,7,null,null,null,null,null,6,null,null,null,null,null,null,69]
[0,"21-I don’t realize I’m anxious until other people tell me. ",null,null,null,null,null,2,null,null,null,null,null,1,null,null,null,null,null,null,70]
[0,"22-When upsetting memories come up, I try to focus on other things.",null,null,null,null,null,5,null,null,null,null,null,4,null,null,null,null,null,null,71]
[0,"23-I am in touch with my emotions.",null,null,null,null,null,5,null,null,null,null,null,4,null,null,null,null,null,null,72]
[0,"24-I am willing to suffer for the things that matter to me. ",null,null,null,null,null,7,null,null,null,null,null,6,null,null,null,null,null,null,73]
[0,"25-One of my big goals is to be free from painful emotions. ",null,null,null,null,null,3,null,null,null,null,null,2,null,null,null,null,null,null,74]
[0,"26-I prefer to stick to what I am comfortable with, rather than try new activities. ",null,null,null,null,null,4,null,null,null,null,null,3,null,null,null,null,null,null,75]
[0,"27-I work hard to keep out upsetting feelings.",null,null,null,null,null,5,null,null,null,null,null,4,null,null,null,null,null,null,76]
[0,"28-People have said that I don’t own up to my problems.",null,null,null,null,null,3,null,null,null,null,null,2,null,null,null,null,null,null,77]
[0,"29-Fear or anxiety won’t stop me from doing something important. ",null,null,null,null,null,2,null,null,null,null,null,1,null,null,null,null,null,null,78]
[0,"30-I try to deal with problems right away. ",null,null,null,null,null,6,null,null,null,null,null,5,null,null,null,null,null,null,79]
[0,"31-I’d do anything to feel less stressed. ",null,null,null,null,null,7,null,null,null,null,null,6,null,null,null,null,null,null,80]
[0,"32-If I have any doubts about doing something, I just won’t do it. ",null,null,null,null,null,3,null,null,null,null,null,2,null,null,null,null,null,null,81]
[0,"33-When unpleasant memories come to me, I try to put them out of my mind.",null,null,null,null,null,4,null,null,null,null,null,{"$f":"IF(H108=1,\"MISSING\", H108-1)","v":3},null,null,null,null,null,null,82]
[0,"34-In this day and age people should not have to suffer. ",null,null,null,null,null,2,null,null,null,null,null,1,null,null,null,null,null,null,83]
[0,"35-Others have told me that I suppress my feelings.",null,null,null,null,null,2,null,null,null,null,null,1,null,null,null,null,null,null,84]
[0,"36-I try to put off unpleasant tasks for as long as possible. ",null,null,null,null,null,3,null,null,null,null,null,2,null,null,null,null,null,null,85]
[0,"37-When I am hurting, I still do what needs to be done. ",null,null,null,null,null,6,null,null,null,null,null,5,null,null,null,null,null,null,86]
[0,"38-My life would be great if I never felt anxious.",null,null,null,null,null,6,null,null,null,null,null,5,null,null,null,null,null,null,87]
[0,"39-If I am starting to feel trapped, I leave the situation immediately. ",null,null,null,null,null,5,null,null,null,null,null,4,null,null,null,null,null,null,88]
[0,"40-When a negative thought comes up, I immediately try to think of something else.",null,null,null,null,null,5,null,null,null,null,null,4,null,null,null,null,null,null,89]
[0,"41-It’s hard for me to know what I’m feeling. ",null,null,null,null,null,4,null,null,null,null,null,3,null,null,null,null,null,null,90]
[0,"42-I won’t do something until I absolutely have to. ",null,null,null,null,null,2,null,null,null,null,null,1,null,null,null,null,null,null,91]
[0,"43-I don’t let pain and discomfort stop me from getting what I want. ",null,null,null,null,null,6,null,null,null,null,null,5,null,null,null,null,null,null,92]
[0,"44-I would give up a lot not to feel bad.",null,null,null,null,null,3,null,null,null,null,null,2,null,null,null,null,null,null,93]
[0,"45-I go out of my way to avoid uncomfortable situations. ",null,null,null,null,null,5,null,null,null,null,null,4,null,null,null,null,null,null,94]
[0,"46-I can numb my feelings when they are too intense.",null,null,null,null,null,2,null,null,null,null,null,1,null,null,null,null,null,null,95]
[0,"47-Why do today what you can put off until tomorrow.",null,null,null,null,null,2,null,null,null,null,null,1,null,null,null,null,null,null,96]
[0,"48-I am willing to put up with sadness to get what I want. ",null,null,null,null,null,4,null,null,null,null,null,3,null,null,null,null,null,null,97]
[0,"49-Some people have told me that I “hide my head in the sand ». ",null,null,null,null,null,2,null,null,null,null,null,1,null,null,null,null,null,null,98]
[0,"50-Pain always leads to suffering.",null,null,null,null,null,3,null,null,null,null,null,2,null,null,null,null,null,null,99]
[0,"51-If I am in a slightly uncomfortable situation, I try to leave right away.",null,null,null,null,null,2,null,null,null,null,null,1,null,null,null,null,null,null,100]
[0,"52-It takes me awhile to realize when I’m feeling bad. ",null,null,null,null,null,4,null,null,null,null,null,3,null,null,null,null,null,null,101]
[0,"53-I continue working toward my goals even if I have doubts. ",null,null,null,null,null,5,null,null,null,null,null,4,null,null,null,null,null,null,102]
[0,"54-I wish I could get rid of all of my negative emotions. ",null,null,null,null,null,6,null,null,null,null,null,5,null,null,null,null,null,null,103]
[0,"55-I avoid situations if there is a chance that I’ll feel nervous. ",null,null,null,null,null,4,null,null,null,null,null,3,null,null,null,null,null,null,104]
[0,"56-I feel disconnected from my emotions.",null,null,null,null,null,2,null,null,null,null,null,1,null,null,null,null,null,null,105]
[0,"57-I don’t let gloomy thoughts stop me from doing what I want. ",null,null,null,null,null,6,null,null,null,null,null,5,null,null,null,null,null,null,106]
[0,"58-The key to a good life is never feeling any pain.",null,null,null,null,null,2,null,null,null,null,null,1,null,null,null,null,null,null,107]
[0,"59-I’m quick to leave any situation that makes me feel uneasy. ",null,null,null,null,null,3,null,null,null,null,null,2,null,null,null,null,null,null,108]
[0,"60-People have told me that I’m not aware of my problems. ",null,null,null,null,null,2,null,null,null,null,null,1,null,null,null,null,null,null,109]
[0,"61-I hope to live without any sadness and disappointment.",null,null,null,null,null,4,null,null,null,null,null,3,null,null,null,null,null,null,110]
[0,"62-When working on something important, I won’t quit even if things get difficult. ",null,null,null,null,null,7,null,null,null,null,null,6,null,null,null,null,null,null,111]
[null,null,null,null,null,null,null,null,null,null,null,null,null,null,null,null,null,null,null,null,112]
[null,null,null,null,null,null,null,null,null,null,null,null,null,null,null,null,null,null,null,null,113]
[null,"UIS",null,null,null,null,null,null,null,null,null,null,null,null,null,null,null,null,null,null,114]
[null,"You will find below a series of statements which describe how people may react to the uncertainties of life. Please use the scale below to describe to what extent each item is characteristic of you. ",null,null,null,null,null,null,null,null,null,null,null,null,null,null,null,null,null,null,115]
[{"$f":"IF(H142=1,1,0)","v":0},"1. Uncertainty stops me from having a strong opinion. ",null,null,null,null,null,4,null,null,null,null,null,{"$f":"IF(H142=1,\"MISSING\", H142-1)","v":3},null,"Please select",null,null,null,null,116]
[0,"2. Being uncertain means that a person is disorganized. ",null,null,null,null,null,2,null,null,null,null,null,1,null,"1 Not at all characteristic of me",1,null,null,null,117]
[0,"3. Uncertainty makes life intolerable.",null,null,null,null,null,3,null,null,null,null,null,2,null,"2 A few characteristic of me ",2,null,null,null,118]
[0,"4. It’s unfair having no guarantees in life.",null,null,null,null,null,3,null,null,null,null,null,2,null,"3 Somewhat characteristic of me",3,null,null,null,119]
[0,"5. My mind can’t be relaxed if I don’t know what will happen tomorrow.",null,null,null,null,null,2,null,null,null,null,null,1,null,"4 Very characteristic of me ",4,null,null,null,120]
[0,"6. Uncertainty makes me uneasy, anxious, or stressed.",null,null,null,null,null,2,null,null,null,null,null,1,null,"5 Entirely characteristic of me",5,null,null,null,121]
[0,"7. Unforeseen events upset me greatly.",null,null,null,null,null,3,null,null,null,null,null,2,null,null,null,null,null,null,122]
[0,"8. It frustrates me not having all the information I need.",null,null,null,null,null,2,null,null,null,null,null,1,null,null,null,null,null,null,123]
[0,"9. Uncertainty keeps me from living a full life.",null,null,null,null,null,2,null,null,null,null,null,1,null,null,null,null,null,null,124]
[0,"10. One should always look ahead so as to avoid surprises.",null,null,null,null,null,2,null,null,null,null,null,1,null,null,null,null,null,null,125]
[0,"11. As mall unforeseen event can spoil everything, even with the best planning.",null,null,null,null,null,4,null,null,null,null,null,3]
[0,"12. When it’s time to act, uncertainty paralyses me. ",null,null,null,null,null,2,null,null,null,null,null,1]
[0,"13. Being uncertain means that I am not first rate.",null,null,null,null,null,2,null,null,null,null,null,1]
[0,"14. When I am uncertain, I can’t go forward.",null,null,null,null,null,2,null,null,null,null,null,1]
[0,"15. When I am uncertain, I can’t function very well. ",null,null,null,null,null,2,null,null,null,null,null,1]
[0,"16. Unlike me, others seem to know where they are going with their lives.",null,null,null,null,null,2,null,null,null,null,null,1]
[0,"17. Uncertainty makes me vulnerable, unhappy, or sad.",null,null,null,null,null,2,null,null,null,null,null,1]
[0,"18. I always want to know what the future has in store for me.",null,null,null,null,null,3,null,null,null,null,null,2]
[0,"19. I can’t stand being taken by surprise.",null,null,null,null,null,2,null,null,null,null,null,1]
[0,"20. The smallest doubt can stop me from acting. ",null,null,null,null,null,2,null,null,null,null,null,1]
[0,"21. I should be able to organize everything in advance.",null,null,null,null,null,2,null,null,null,null,null,1]
[0,"22. Being uncertain means that I lack confidence.",null,null,null,null,null,2,null,null,null,null,null,1]
[0,"23. I think it’s unfair that other people seem to be sure about their future.",null,null,null,null,null,2,null,null,null,null,null,1]
[0,"24. Uncertainty keeps me from sleeping soundly. ",null,null,null,null,null,2,null,null,null,null,null,1]
[0,"25. I must get away from all uncertain situations.",null,null,null,null,null,2,null,null,null,null,null,1]
[0,"26. The ambiguities in life stress me.",null,null,null,null,null,3,null,null,null,null,null,2]
[0,"27. I can’t stand being undecided about my future. ",null,null,null,null,null,2,null,null,null,null,null,1]
[]
[]
[null,"MCQ-30"]
[null,"This questionnaire is concerned with beliefs people have about their thinking. Listed below are a number of beliefs that people have expressed. Please read each item and say how much you generally agree with it by selecting the appropriate answer. Please respond to all the items, there are no right or wrong answers."]
[{"$f":"IF(H173=1,1,0)","v":0},1,"Worrying helps me to avoid problems in the future",null,null,null,null,4,null,null,null,null,null,{"$f":"IF(H173=1,\"MISSING\", H173-1)","v":3},null,"Please select"]
[0,2,"My worrying is dangerous for me",null,null,null,null,3,null,null,null,null,null,2,null,"1 Do not agree",1]
[0,3,"I think a lot about my thoughts",null,null,null,null,2,null,null,null,null,null,1,null,"2 Agree slightly",2]
[0,4,"I could make myself sick with worrying",null,null,null,null,3,null,null,null,null,null,2,null,"3 Agree moderately",3]
[0,5,"I am aware of the way my mind works when I am thinking through a problem",null,null,null,null,2,null,null,null,null,null,1,null,"4 Agree very much",4]
[0,6,"If I did not control a worrying thought, and then it happened, it would be my fault",null,null,null,null,5,null,null,null,null,null,4]
[0,7,"I need to worry in order to remain organized",null,null,null,null,3,null,null,null,null,null,2]
[0,8,"I have little confidence in my memory for words and names",null,null,null,null,2,null,null,null,null,null,1]
[0,9,"My worrying thoughts persist, no matter how I try to stop them",null,null,null,null,5,null,null,null,null,null,4]
[0,10,"Worrying helps me to get things sorted out in my mind",null,null,null,null,3,null,null,null,null,null,2]
[0,11,"I cannot ignore my worrying thoughts",null,null,null,null,5,null,null,null,null,null,4]
[0,12,"I monitor my thoughts",null,null,null,null,2,null,null,null,null,null,1]
[0,13,"I should be in control of my thoughts all of the time",null,null,null,null,3,null,null,null,null,null,2]
[0,14,"My memory can mislead me at times",null,null,null,null,5,null,null,null,null,null,4]
[0,15,"My worrying could make me go mad",null,null,null,null,3,null,null,null,null,null,2]
[0,16,"I am constantly aware of my thinking",null,null,null,null,2,null,null,null,null,null,1]
[0,17,"I have a poor memory",null,null,null,null,5,null,null,null,null,null,4]
[0,18,"I pay close attention to the way my mind works",null,null,null,null,3,null,null,null,null,null,2]
[0,19,"Worrying helps me to cope",null,null,null,null,2,null,null,null,null,null,1]
[0,20,"Not being able to control my thoughts is a sign of weakness",null,null,null,null,3,null,null,null,null,null,2]
[0,21,"If I could not control my thoughts, I would not be able to function",null,null,null,null,2,null,null,null,null,null,1]
[0,22,"When I start worrying, I cannot stop",null,null,null,null,4,null,null,null,null,null,3]
[0,23,"I will be punished for not controlling certain thoughts",null,null,null,null,2,null,null,null,null,null,1]
[0,24,"Worrying helps me to solve problems",null,null,null,null,2,null,null,null,null,null,1]
[0,25,"I have little confidence in my memory for places",null,null,null,null,2,null,null,null,null,null,1]
[0,26,"It is bad to think certain thoughts",null,null,null,null,5,null,null,null,null,null,4]
[0,27,"I do not trust my memory",null,null,null,null,5,null,null,null,null,null,4]
[0,28,"I need to worry in order to work well",null,null,null,null,3,null,null,null,null,null,2]
[0,29,"I have little confidence in my memory for actions",null,null,null,null,2,null,null,null,null,null,1]
[0,30,"I constantly examine my thoughts",null,null,null,null,2,null,null,null,null,null,1]
[]
[]
[null,"Mini-CERTS"]
[null,"Read each item and then decide how you generally respond. Please put ONE tick for each row. Don’t agonise over individual answers, give the first response to each line that comes to mind."]
[null,"«  When thoughts about myself, feelings, situations or events do come to mind … »"]
[{"$f":"IF(H208=1,1,0)","v":0},"1. My thinking tends to get stuck in a rut, involving only a few themes. ",null,null,null,null,null,4,null,null,null,null,null,{"$f":"IF(H208=1,\"MISSING\", H208-1)","v":3},null,"Please select"]
[0,"2. I can grasp and respond to changes in the world around me without having to analyze the details",null,null,null,null,null,4,null,null,null,null,null,3,null,"Almost never"]
[0,"3. I compare myself to other people",null,null,null,null,null,5,null,null,null,null,null,4,null,"Sometimes"]
[0,"4. My thinking tends to become open, loose, expansive and creative",null,null,null,null,null,3,null,null,null,null,null,2,null,"Often"]
[0,"5. I judge myself against my own standards and beliefs",null,null,null,null,null,4,null,null,null,null,null,3,null,"Almost Always"]
[0,"6. I focus on why things happened the way they did",null,null,null,null,null,3,null,null,null,null,null,2]
[0,"7. I think about why I can’t get started on something",null,null,null,null,null,2,null,null,null,null,null,1]
[0,"8. My thoughts move in new and interesting directions ",null,null,null,null,null,2,null,null,null,null,null,1]
[0,"9. I seem to be engaged in and directly in touch with what is going on around me ",null,null,null,null,null,3,null,null,null,null,null,2]
[0,"10. I think I’m no good at all",null,null,null,null,null,3,null,null,null,null,null,2]
[0,"11. I’m relaxed about going with the flow of what comes to mind",null,null,null,null,null,4,null,null,null,null,null,3]
[0,"12. I feel under pressure to stop my worse fears happening",null,null,null,null,null,5,null,null,null,null,null,4]
[0,"13. I focus on exploring and playing with ideas, curious about where it will lead",null,null,null,null,null,2,null,null,null,null,null,1]
[0,"14. My thinking tends to spiral out from one specific event to broader, general aspects of my life ",null,null,null,null,null,4,null,null,null,null,null,3]
[0,"15. I am concerned about what other people might think of me ",null,null,null,null,null,5,null,null,null,null,null,4]
[0,"16. I have very rapid impressions and intuitions of what is happening around me ",null,null,null,null,null,3,null,null,null,null,null,2]
[]
[]
[null,"SE"]
[null,"Each of us develops beliefs about our capacity and skills in different areas. For the various areas below (as well as others that may seem relevant to you), indicate the level of confidence with which you think you can handle things with the following scale:"]
[]
[null,"To handle things means doing what needs to be done, to have the right attitude, to be able to cope. "]
[null,"I have confidence in my ability to handle things … ",null,null,null,null,null,"Please fill in a number between 0 and 100 in the boxes below.Veuillez remplir un chiffre allant de 0 à 100 dans les cases ci-dessous. If this area is not relevant to you, simply note N / A for not applicable."]
[{"$f":"IF(ISBLANK(H231),1,0)","v":0},"…in the relationships within family",null,null,null,null,null,25,null,null,null,null,null,{"$f":"(IF(ISBLANK(H231),\"MISSING\",H231))","v":25}]
[{"$f":"IF(ISBLANK(H232),1,0)","v":0},"…in the relationships within my couple",null,null,null,null,null,75,null,null,null,null,null,75]
[0,"…in the relationships with my friends",null,null,null,null,null,60,null,null,null,null,null,60]
[0,"…in my professional relationships",null,null,null,null,null,60,null,null,null,null,null,60]
[0,"…as a parent",null,null,null,null,null,80,null,null,null,null,null,80]
[0,"…in my sexual life",null,null,null,null,null,50,null,null,null,null,null,50]
[0,"…in my profession or my studies",null,null,null,null,null,75,null,null,null,null,null,75]
[0,"…in the regulation of  my emotions",null,null,null,null,null,20,null,null,null,null,null,20]
[0,"...in my free time, my hobbies",null,null,null,null,null,10,null,null,null,null,null,10]
[0,"…in daily tasks / housework",null,null,null,null,null,20,null,null,null,null,null,20]
[null,"Possibly, other(s) fields that you may consider significant(s) :"]
[{"$f":"IF(AND(ISTEXT(C242),ISBLANK(H242)),1,IF(ISBLANK(H242),0,0))","v":0},"…in",null,null,null,null,null,null,null,null,null,null,null,{"$f":"IF(AND(ISTEXT(C242),ISBLANK(H242)),\"MISSING\",IF(ISBLANK(H242),\"VIDE\",H242))","v":"VIDE"}]
[{"$f":"IF(AND(ISTEXT(C243),ISBLANK(H243)),1,IF(ISBLANK(H243),0,0))","v":0},"…in",null,null,null,null,null,null,null,null,null,null,null,{"$f":"IF(AND(ISTEXT(C243),ISBLANK(H243)),\"MISSING\",IF(ISBLANK(H243),\"VIDE\",H243))","v":"VIDE"}]
[0,"…in",null,null,null,null,null,null,null,null,null,null,null,{"$f":"IF(AND(ISTEXT(C244),ISBLANK(H244)),\"MISSING\",IF(ISBLANK(H244),\"VIDE\",H244))","v":"VIDE"}]
[]
[]
[null,"Self-discrepancies Questionnaire"]
[null,"Think for a moment and make a list of the features you would like to possess ideally and of those you definitely don’t want to have (whether or not you think to possess them). To help you, if necessary, here are some examples of possible features:"]
[]
[null,"Ideal Self"]
[null,"Features I would like to have: ",null,null,null,null,"%","Features I wouldn’t like to have :","%"]
[null,"Calm, philosoph",null,null,null,null,0.3,"Selfish",0.1]
[null,"Erudite",null,null,null,null,0.4,"Disdainful",0]
[null,"Well-organized",null,null,null,null,0.5,"Dishonest",0.05]
[]
[]
[]
[]
[]
[null,"For each desirable feature, indicate in the right column the extent to which you possess this feature, the ideal being 100%. For example, if you have a generosity ideal and that you think to actually possess this characteristic at 80% of your ideal, please write  « Generous : 80% ».",null,null,null,null,null,"For each undesirable feature, indicate in the right column the extent to which you possess this feature, the ideal being 0%. For example, if you dislike stinginess and that you think to possess this feature at 20%, please write « Stingy : 20% »."]
[]
[null,"Choose the correct answer."]
[null,"How big is the discrepancy between this ideal and the way you perceive yourself?"]
[{"$f":"IF(H264=0,1,0)","v":0},null,null,null,null,null,null,6,null,null,null,null,null,{"$f":"IF(H264=0,\"MISSING\",H264)","v":6}]
[]
[null,"How strong is the distress caused by this discrepancy?"]
[{"$f":"IF(H267=0,1,0)","v":0},null,null,null,null,null,null,4,null,null,null,null,null,{"$f":"IF(H267=0,\"MISSING\",H267)","v":4}]
[]
[null,"Think for a moment and make a list of the features that are expected from you by your relatives (regardless of whether or not you think you possess them)."]
[null,"Ought self"]
[null,"Features that the important people to me think I should have :",null,null,null,null,"%","Features that the important people to me think that I should not have :","%"]
[null,"Calm",null,null,null,null,0.3,"Selfish",0.1]
[null,"Altruistic",null,null,null,null,0.9,"Disdainful",0.05]
[null,"Well-organized",null,null,null,null,0.5,"Full of hate",0.2]
[]
[]
[]
[]
[]
[null,"For each desirable feature, indicate in the right column the extent to which you possess this feature, the ideal being 100%. For example, if you think that your relatives have an ideal of generosity for yourself and that you think to actually possess this characteristic at 80% of your ideal, please write  « Generous : 80% ».",null,null,null,null,null,"For each undesirable feature, indicate in the right column the extent to which you possess this feature, the ideal being 0%. For example, if your relatives dislike you being stingy and that you think to actually possess this feature at 20%, please write « Stingy : 20% »."]
[]
[null,"Choose the correct answer."]
[null,"How big is globally the discrepancy between this ideal and the way you perceive yourself?"]
[]
[{"$f":"IF(H285=0,1,0)","v":0},null,null,null,null,null,null,5,null,null,null,null,null,{"$f":"IF(H285=0,\"MISSING\",H285)","v":5}]
[]
[null,"How strong is the distress caused by this discrepancy?"]
[{"$f":"IF(H288=0,1,0)","v":0},null,null,null,null,null,null,5,null,null,null,null,null,{"$f":"IF(H288=0,\"MISSING\",H288)","v":5}]
[]
[null,"This survey is over. Thank you for your time. Before exiting, don't forfet to save the file in a definite location on your computer. Then you can send it back my mail (with attached file) to the contact person."]

{"sheet":"Quest T2","index":2,"n_rows":275,"n_cols":17,"rows_kept":275,"cut":false,"hidden":false,"merged":[[264,1,264,6],[264,7,264,8],[266,1,266,7],[267,1,267,7],[271,1,271,7],[274,1,274,7],[258,1,258,5],[259,1,259,5],[260,1,260,5],[261,1,261,5],[262,1,262,5],[263,1,263,5],[250,1,250,7],[253,1,253,8],[254,1,254,8],[255,1,255,5],[256,1,256,5],[257,1,257,5],[242,1,242,5],[243,1,243,5],[244,1,244,6],[244,7,244,8],[246,1,246,7],[247,1,247,7],[236,1,236,5],[237,1,237,5],[238,1,238,5],[239,1,239,5],[240,1,240,5],[241,1,241,5],[228,2,228,6],[231,1,231,8],[232,1,232,8],[233,1,233,7],[234,1,234,8],[235,1,235,5],[222,1,222,6],[223,1,223,6],[224,1,224,6],[225,1,225,6],[226,2,226,6],[227,2,227,6],[216,1,216,6],[217,1,217,6],[218,1,218,6],[219,1,219,6],[220,1,220,6],[221,1,221,6],[210,1,210,7],[211,1,211,7],[212,1,212,7],[213,1,213,7],[214,1,214,6],[215,1,215,6],[202,1,202,6],[203,1,203,6],[204,1,204,6],[205,1,205,6],[206,1,206,6],[207,1,207,6],[196,1,196,6],[197,1,197,6],[198,1,198,6],[199,1,199,6],[200,1,200,6],[201,1,201,6],[190,1,190,7],[191,1,191,7],[192,1,192,6],[193,1,193,6],[194,1,194,6],[195,1,195,6],[182,2,182,6],[183,2,183,6],[184,2,184,6],[185,2,185,6],[186,2,186,6],[189,1,189,7],[176,2,176,6],[177,2,177,6],[178,2,178,6],[179,2,179,6],[180,2,180,6],[181,2,181,6],[170,2,170,6],[171,2,171,6],[172,2,172,6],[173,2,173,6],[174,2,174,6],[175,2,175,6],[164,2,164,6],[165,2,165,6],[166,2,166,6],[167,2,167,6],[168,2,168,6],[169,2,169,6],[158,2,158,6],[159,2,159,6],[160,2,160,6],[161,2,161,6],[162,2,162,6],[163,2,163,6],[150,1,150,6],[151,1,151,6],[152,1,152,6],[155,1,155,7],[156,1,156,7],[157,2,157,6],[144,1,144,6],[145,1,145,6],[146,1,146,6],[147,1,147,6],[148,1,148,6],[149,1,149,6],[138,1,138,6],[139,1,139,6],[140,1,140,6],[141,1,141,6],[142,1,142,6],[143,1,143,6],[132,1,132,6],[133,1,133,6],[134,1,134,6],[135,1,135,6],[136,1,136,6],[137,1,137,6],[126,1,126,6],[127,1,127,6],[128,1,128,6],[129,1,129,6],[130,1,130,6],[131,1,131,6],[118,1,118,6],[119,1,119,6],[120,1,120,6],[121,1,121,6],[124,1,124,7],[125,1,125,7],[112,1,112,6],[113,1,113,6],[114,1,114,6],[115,1,115,6],[116,1,116,6],[117,1,117,6],[106,1,106,6],[107,1,107,6],[108,1,108,6],[109,1,109,6],[110,1,110,6],[111,1,111,6],[100,1,100,6],[101,1,101,6],[102,1,102,6],[103,1,103,6],[104,1,104,6],[105,1,105,6],[94,1,94,6],[95,1,95,6],[96,1,96,6],[97,1,97,6],[98,1,98,6],[99,1,99,6],[88,1,88,6],[89,1,89,6],[90,1,90,6],[91,1,91,6],[92,1,92,6],[93,1,93,6],[82,1,82,6],[83,1,83,6],[84,1,84,6],[85,1,85,6],[86,1,86,6],[87,1,87,6],[76,1,76,6],[77,1,77,6],[78,1,78,6],[79,1,79,6],[80,1,80,6],[81,1,81,6],[70,1,70,6],[71,1,71,6],[72,1,72,6],[73,1,73,6],[74,1,74,6],[75,1,75,6],[64,1,64,6],[65,1,65,6],[66,1,66,6],[67,1,67,6],[68,1,68,6],[69,1,69,6],[58,1,58,7],[59,1,59,7],[60,1,60,6],[61,1,61,6],[62,1,62,6],[63,1,63,6],[50,1,50,6],[51,1,51,6],[52,1,52,6],[53,1,53,6],[54,1,54,6],[55,1,55,6],[44,1,44,6],[45,1,45,6],[46,1,46,6],[47,1,47,6],[48,1,48,6],[49,1,49,6],[38,1,38,6],[39,1,39,6],[40,1,40,6],[41,1,41,6],[42,1,42,6],[43,1,43,6],[30,2,30,6],[33,1,33,7],[34,1,34,7],[35,1,35,6],[36,1,36,6],[37,1,37,6],[24,2,24,6],[25,2,25,6],[26,2,26,6],[27,2,27,6],[28,2,28,6],[29,2,29,6],[21,2,21,6],[22,2,22,6],[23,2,23,6],[12,2,12,6],[13,2,13,6],[14,2,14,6],[15,2,15,6],[16,2,16,6],[17,2,17,6],[8,1,8,7],[9,1,9,7],[10,2,10,6],[11,2,11,6],[1,1,2,7],[3,1,3,7],[18,2,18,6],[19,2,19,6],[20,2,20,6]]}
[null,null,null,null,null,null,null,null,null,null,null,null,null,"Réponse"]
[null,"PROCESSES ASSESMENT PROTOCOL - T2"]
[]
[null,"This page contains several questionnaires that measure psychological processes. Those questionnaires don't aim at assessing categorical diagnosis but intend to measure your way of functionning. Please answer those questions the most sincerely. In answering those questionnaires, you give your informed consent that your data may me used for research purpose. The data will be treated anonymously."]
[]
[]
[]
[]
[null,"DASS-21"]
[null,"Please read each statement and circle a number 0, 1, 2 or 3 which indicates how much the statement applied to you over the past week.  There are no right or wrong answers.  Do not spend too much time on any statement.  "]
[{"$f":"IF(H11=1,1,0)","v":0},1,"I found it hard to wind down.",null,null,null,null,3,null,null,null,null,null,{"$f":"IF(H11=1,\"MISSING\", H11-2)","v":1},null,"Please select"]
[{"$f":"IF(H12=1,1,0)","v":0},2,"I was aware of dryness of my mouth.",null,null,null,null,2,null,null,null,null,null,0,null,"0  Did not apply to me at all"]
[0,3,"I couldn’t seem to experience any positive feeling at all.",null,null,null,null,2,null,null,null,null,null,0,null,"1  Applied to me to some degree, or some of the time"]
[0,4,"I experienced breathing difficulty (eg, excessively rapid breathing, Breathlessness in the absence of physical exertion)",null,null,null,null,2,null,null,null,null,null,0,null,"2  Applied to me to a considerable degree, or a good part of time"]
[0,5,"I found it difficult to work up the initiative to do things.",null,null,null,null,2,null,null,null,null,null,0,null,"3  Applied to me very much, or most of the time"]
[0,6,"I tended to over-react to situations.",null,null,null,null,3,null,null,null,null,null,1]
[0,7,"I experienced trembling (e.g., in the hands).",null,null,null,null,2,null,null,null,null,null,0]
[0,8,"I felt that I was using a lot of nervous energy",null,null,null,null,3,null,null,null,null,null,1]
[0,9,"I was worried about situations in which I might panic and make a fool of myself.",null,null,null,null,4,null,null,null,null,null,2]
[0,10,"I felt that I had nothing to look forward to.",null,null,null,null,2,null,null,null,null,null,0]
[0,11,"I found myself getting agitated.",null,null,null,null,3,null,null,null,null,null,1]
[0,12,"I found it difficult to relax.",null,null,null,null,3,null,null,null,null,null,1]
[0,13,"I felt down-hearted and blue.",null,null,null,null,3,null,null,null,null,null,1]
[0,14,"I was intolerant of anything that kept me from getting on with what I was doing ",null,null,null,null,2,null,null,null,null,null,0]
[0,15,"I felt I was close to panic.",null,null,null,null,3,null,null,null,null,null,1]
[0,16,"I was unable to become enthusiastic about anything.",null,null,null,null,2,null,null,null,null,null,0]
[0,17,"I felt I wasn’t worth much as a person.",null,null,null,null,2,null,null,null,null,null,0]
[0,18,"I felt that I was rather touchy.",null,null,null,null,3,null,null,null,null,null,1]
[0,19,"I was aware of the action of my heart in the absence of physical exertion (e.g. sense of heart increase, heart missing a beat).",null,null,null,null,2,null,null,null,null,null,0]
[0,20,"I felt scared without any good reason.",null,null,null,null,3,null,null,null,null,null,1]
[0,21,"I felt that life was meaningless.",null,null,null,null,2,null,null,null,null,null,0]
[]
[]
[null,"REQ-21"]
[null,"We all experience many different feelings or emotions. For example, different things in our lives make us happy, sad, angry, etc.\nThe following questionnaire asks you about how often you do certain things in response to your emotions. You do not have to think about specific emotions but just how often you generally do the things listed below.\nPlease tick the box corresponding to the answer that fits best. We all respond to our emotions in different ways so there are no right or wrong answers."]
[{"$f":"IF(H36=1,1,0)","v":0},"1.      I talk to someone about how I feel",null,null,null,null,null,4,null,null,null,null,null,{"$f":"IF(H36=1,\"MISSING\", H36-1)","v":3},null,"Please select"]
[0,"2.      I take my feelings out on others verbally (e.g., shouting, arguing). ",null,null,null,null,null,3,null,null,null,null,null,2,null,"Never",1]
[0,"3.      I seek physical contact from friends of family (e.g., a hug, hold hands).",null,null,null,null,null,2,null,null,null,null,null,1,null,"Seldom",2]
[0,"4.      I reviews (rethink) my thoughts or beliefs.",null,null,null,null,null,5,null,null,null,null,null,4,null,"Often",3]
[0,"5.      I harm or punish myself in some way.",null,null,null,null,null,2,null,null,null,null,null,1,null,"Very often",4]
[0,"6.      I do something energetic (e.g., play sport, go for a walk).",null,null,null,null,null,2,null,null,null,null,null,1,null,"Always",5]
[0,"7.      I dwell on my thoughts and feelings (e.g., It goes round and round in my head and I can’t stop it).",null,null,null,null,null,4,null,null,null,null,null,3]
[0,"8.      I ask others for advice.",null,null,null,null,null,4,null,null,null,null,null,3]
[0,"9.      I review (rethink) my goals or plans. ",null,null,null,null,null,3,null,null,null,null,null,2]
[0,"10.  I take my feelings out on others physically (e.g., fighting, lashing out). ",null,null,null,null,null,2,null,null,null,null,null,1]
[0,"11.  I put the situation into perspective.",null,null,null,null,null,3,null,null,null,null,null,2]
[0,"12.  I concentrate on a pleasant activity. ",null,null,null,null,null,3,null,null,null,null,null,2]
[0,"13.  I try to make others feel bad (e.g., being rude, ignoring them). ",null,null,null,null,null,2,null,null,null,null,null,1]
[0,"14.  I think about people better off and make myself feel worse.",null,null,null,null,null,2,null,null,null,null,null,1]
[0,"15.  I keep the feeling locked up inside. ",null,null,null,null,null,3,null,null,null,null,null,2]
[0,"16.  I plan what I could do better next time.",null,null,null,null,null,4,null,null,null,null,null,3]
[0,"17.  I bully other people (e.g. saying nasty things to them, hitting them)",null,null,null,null,null,2,null,null,null,null,null,1]
[0,"18.  I take my feelings out on objects around me (e.g., deliberately causing damage to my house, school or outdoor things). ",null,null,null,null,null,2,null,null,null,null,null,1]
[0,"19.  Things feel unreal (e.g., I feel strange, things around me feel strange, I daydream).",null,null,null,null,null,2,null,null,null,null,null,1]
[0,"20.  I telephone friends or family. ",null,null,null,null,null,3,null,null,null,null,null,2]
[0,"21.  I go out and do something nice (e.g., cinema, shopping, go for a meal, meet people). ",null,null,null,null,null,4,null,null,null,null,null,3]
[]
[]
[null,"MEAQ"]
[null,"Please indicate the extent to which you agree or disagree with each of the following statements"]
[{"$f":"IF(H61=1,1,0)","v":0},"1-I won’t do something if I think it will make me uncomfortable.",null,null,null,null,null,3,null,null,null,null,null,{"$f":"IF(H61=1,\"MISSING\", H61-1)","v":2},null,"Please select"]
[0,"2-If I could magically remove all of my painful memories, I would. ",null,null,null,null,null,6,null,null,null,null,null,5,null,"Strongly disagree ",1]
[0,"3-When something upsetting comes up, I try very hard to stop thinking about it. ",null,null,null,null,null,2,null,null,null,null,null,1,null,"Moderately  disagree ",2]
[0,"4-I sometimes have difficulty identifying how I feel.",null,null,null,null,null,3,null,null,null,null,null,2,null,"Slightly disagree ",3]
[0,"5-I tend to put off unpleasant things that need to get done. ",null,null,null,null,null,2,null,null,null,null,null,1,null,"Slightly agree ",4]
[0,"6-People should face their fears.",null,null,null,null,null,6,null,null,null,null,null,5,null,"Moderatly agree ",5]
[0,"7-Happiness means never feeling any pain or disappointment. ",null,null,null,null,null,2,null,null,null,null,null,1,null,"Strongly agree ",6]
[0,"8-I avoid activities if there is even a small possibility of getting hurt.",null,null,null,null,null,3,null,null,null,null,null,2]
[0,"9-When negative thoughts come up, I try to fill my head with something else.",null,null,null,null,null,3,null,null,null,null,null,2]
[0,"10-At times, people have told me I’m in denial.",null,null,null,null,null,2,null,null,null,null,null,1]
[0,"11-I sometimes procrastinate to avoid facing challenges.",null,null,null,null,null,3,null,null,null,null,null,2]
[0,"12-Even when I feel uncomfortable, I don’t give up working toward things I value. ",null,null,null,null,null,6,null,null,null,null,null,5]
[0,"13-When I am hurting, I would do anything to feel better.",null,null,null,null,null,5,null,null,null,null,null,4]
[0,"14-I rarely do something if there is a chance that it will upset me. ",null,null,null,null,null,4,null,null,null,null,null,3]
[0,"15-I usually try to distract myself when I feel something painful. ",null,null,null,null,null,3,null,null,null,null,null,2]
[0,"16-I am able to « turn off » my emotions when I don’t want to feel.  ",null,null,null,null,null,2,null,null,null,null,null,1]
[0,"17-When I have something important to do I find myself doing a lot of other things instead. ",null,null,null,null,null,3,null,null,null,null,null,2]
[0,"18-I am willing to put up with pain and discomfort to get what I want. ",null,null,null,null,null,4,null,null,null,null,null,3]
[0,"19-Happiness involves getting rid of negative thoughts. ",null,null,null,null,null,5,null,null,null,null,null,4]
[0,"20-I work hard to avoid situations that might bring up unpleasant thoughts and feelings in me. ",null,null,null,null,null,4,null,null,null,null,null,3]
[0,"21-I don’t realize I’m anxious until other people tell me. ",null,null,null,null,null,2,null,null,null,null,null,1]
[0,"22-When upsetting memories come up, I try to focus on other things.",null,null,null,null,null,3,null,null,null,null,null,2]
[0,"23-I am in touch with my emotions.",null,null,null,null,null,3,null,null,null,null,null,2]
[0,"24-I am willing to suffer for the things that matter to me. ",null,null,null,null,null,5,null,null,null,null,null,4]
[0,"25-One of my big goals is to be free from painful emotions. ",null,null,null,null,null,2,null,null,null,null,null,1]
[0,"26-I prefer to stick to what I am comfortable with, rather than try new activities. ",null,null,null,null,null,2,null,null,null,null,null,1]
[0,"27-I work hard to keep out upsetting feelings.",null,null,null,null,null,4,null,null,null,null,null,3]
[0,"28-People have said that I don’t own up to my problems.",null,null,null,null,null,2,null,null,null,null,null,1]
[0,"29-Fear or anxiety won’t stop me from doing something important. ",null,null,null,null,null,2,null,null,null,null,null,1]
[0,"30-I try to deal with problems right away. ",null,null,null,null,null,5,null,null,null,null,null,4]
[0,"31-I’d do anything to feel less stressed. ",null,null,null,null,null,6,null,null,null,null,null,5]
[0,"32-If I have any doubts about doing something, I just won’t do it. ",null,null,null,null,null,3,null,null,null,null,null,2]
[0,"33-When unpleasant memories come to me, I try to put them out of my mind.",null,null,null,null,null,3,null,null,null,null,null,{"$f":"IF(H93=1,\"MISSING\", H93-1)","v":2}]
[0,"34-In this day and age people should not have to suffer. ",null,null,null,null,null,3,null,null,null,null,null,2]
[0,"35-Others have told me that I suppress my feelings.",null,null,null,null,null,2,null,null,null,null,null,1]
[0,"36-I try to put off unpleasant tasks for as long as possible. ",null,null,null,null,null,3,null,null,null,null,null,2]
[0,"37-When I am hurting, I still do what needs to be done. ",null,null,null,null,null,6,null,null,null,null,null,5]
[0,"38-My life would be great if I never felt anxious.",null,null,null,null,null,6,null,null,null,null,null,5]
[0,"39-If I am starting to feel trapped, I leave the situation immediately. ",null,null,null,null,null,3,null,null,null,null,null,2]
[0,"40-When a negative thought comes up, I immediately try to think of something else.",null,null,null,null,null,3,null,null,null,null,null,2]
[0,"41-It’s hard for me to know what I’m feeling. ",null,null,null,null,null,5,null,null,null,null,null,4]
[0,"42-I won’t do something until I absolutely have to. ",null,null,null,null,null,2,null,null,null,null,null,1]
[0,"43-I don’t let pain and discomfort stop me from getting what I want. ",null,null,null,null,null,3,null,null,null,null,null,2]
[0,"44-I would give up a lot not to feel bad.",null,null,null,null,null,3,null,null,null,null,null,2]
[0,"45-I go out of my way to avoid uncomfortable situations. ",null,null,null,null,null,4,null,null,null,null,null,3]
[0,"46-I can numb my feelings when they are too intense.",null,null,null,null,null,2,null,null,null,null,null,1]
[0,"47-Why do today what you can put off until tomorrow.",null,null,null,null,null,2,null,null,null,null,null,1]
[0,"48-I am willing to put up with sadness to get what I want. ",null,null,null,null,null,5,null,null,null,null,null,4]
[0,"49-Some people have told me that I “hide my head in the sand ». ",null,null,null,null,null,2,null,null,null,null,null,1]
[0,"50-Pain always leads to suffering.",null,null,null,null,null,4,null,null,null,null,null,3]
[0,"51-If I am in a slightly uncomfortable situation, I try to leave right away.",null,null,null,null,null,2,null,null,null,null,null,1]
[0,"52-It takes me awhile to realize when I’m feeling bad. ",null,null,null,null,null,3,null,null,null,null,null,2]
[0,"53-I continue working toward my goals even if I have doubts. ",null,null,null,null,null,5,null,null,null,null,null,4]
[0,"54-I wish I could get rid of all of my negative emotions. ",null,null,null,null,null,5,null,null,null,null,null,4]
[0,"55-I avoid situations if there is a chance that I’ll feel nervous. ",null,null,null,null,null,4,null,null,null,null,null,3]
[0,"56-I feel disconnected from my emotions.",null,null,null,null,null,2,null,null,null,null,null,1]
[0,"57-I don’t let gloomy thoughts stop me from doing what I want. ",null,null,null,null,null,7,null,null,null,null,null,6]
[0,"58-The key to a good life is never feeling any pain.",null,null,null,null,null,2,null,null,null,null,null,1]
[0,"59-I’m quick to leave any situation that makes me feel uneasy. ",null,null,null,null,null,2,null,null,null,null,null,1]
[0,"60-People have told me that I’m not aware of my problems. ",null,null,null,null,null,2,null,null,null,null,null,1]
[0,"61-I hope to live without any sadness and disappointment.",null,null,null,null,null,3,null,null,null,null,null,2]
[0,"62-When working on something important, I won’t quit even if things get difficult. ",null,null,null,null,null,7,null,null,null,null,null,6]
[]
[]
[null,"UIS"]
[null,"You will find below a series of statements which describe how people may react to the uncertainties of life. Please use the scale below to describe to what extent each item is characteristic of you. "]
[{"$f":"IF(H127=1,1,0)","v":0},"1. Uncertainty stops me from having a strong opinion. ",null,null,null,null,null,4,null,null,null,null,null,{"$f":"IF(H127=1,\"MISSING\", H127-1)","v":3},null,"Please select"]
[0,"2. Being uncertain means that a person is disorganized. ",null,null,null,null,null,2,null,null,null,null,null,1,null,"Not at all characteristic of me",1]
[0,"3. Uncertainty makes life intolerable.",null,null,null,null,null,2,null,null,null,null,null,1,null,"A few characteristic of me ",2]
[0,"4. It’s unfair having no guarantees in life.",null,null,null,null,null,2,null,null,null,null,null,1,null,"Somewhat characteristic of me",3]
[0,"5. My mind can’t be relaxed if I don’t know what will happen tomorrow.",null,null,null,null,null,2,null,null,null,null,null,1,null,"Very characteristic of me ",4]
[0,"6. Uncertainty makes me uneasy, anxious, or stressed.",null,null,null,null,null,2,null,null,null,null,null,1,null,"Entirely characteristic of me",5]
[0,"7. Unforeseen events upset me greatly.",null,null,null,null,null,2,null,null,null,null,null,1]
[0,"8. It frustrates me not having all the information I need.",null,null,null,null,null,2,null,null,null,null,null,1]
[0,"9. Uncertainty keeps me from living a full life.",null,null,null,null,null,2,null,null,null,null,null,1]
[0,"10. One should always look ahead so as to avoid surprises.",null,null,null,null,null,2,null,null,null,null,null,1]
[0,"11. As mall unforeseen event can spoil everything, even with the best planning.",null,null,null,null,null,5,null,null,null,null,null,4]
[0,"12. When it’s time to act, uncertainty paralyses me. ",null,null,null,null,null,2,null,null,null,null,null,1]
[0,"13. Being uncertain means that I am not first rate.",null,null,null,null,null,2,null,null,null,null,null,1]
[0,"14. When I am uncertain, I can’t go forward.",null,null,null,null,null,2,null,null,null,null,null,1]
[0,"15. When I am uncertain, I can’t function very well. ",null,null,null,null,null,2,null,null,null,null,null,1]
[0,"16. Unlike me, others seem to know where they are going with their lives.",null,null,null,null,null,2,null,null,null,null,null,1]
[0,"17. Uncertainty makes me vulnerable, unhappy, or sad.",null,null,null,null,null,2,null,null,null,null,null,1]
[0,"18. I always want to know what the future has in store for me.",null,null,null,null,null,2,null,null,null,null,null,1]
[0,"19. I can’t stand being taken by surprise.",null,null,null,null,null,3,null,null,null,null,null,2]
[0,"20. The smallest doubt can stop me from acting. ",null,null,null,null,null,2,null,null,null,null,null,1]
[0,"21. I should be able to organize everything in advance.",null,null,null,null,null,3,null,null,null,null,null,2]
[0,"22. Being uncertain means that I lack confidence.",null,null,null,null,null,2,null,null,null,null,null,1]
[0,"23. I think it’s unfair that other people seem to be sure about their future.",null,null,null,null,null,2,null,null,null,null,null,1]
[0,"24. Uncertainty keeps me from sleeping soundly. ",null,null,null,null,null,2,null,null,null,null,null,1]
[0,"25. I must get away from all uncertain situations.",null,null,null,null,null,2,null,null,null,null,null,1]
[0,"26. The ambiguities in life stress me.",null,null,null,null,null,2,null,null,null,null,null,1]
[0,"27. I can’t stand being undecided about my future. ",null,null,null,null,null,3,null,null,null,null,null,2]
[]
[]
[null,"MCQ-30"]
[null,"This questionnaire is concerned with beliefs people have about their thinking. Listed below are a number of beliefs that people have expressed. Please read each item and say how much you generally agree with it by selecting the appropriate answer. Please respond to all the items, there are no right or wrong answers."]
[{"$f":"IF(H158=1,1,0)","v":0},1,"Worrying helps me to avoid problems in the future",null,null,null,null,3,null,null,null,null,null,{"$f":"IF(H158=1,\"MISSING\", H158-1)","v":2},null,"Please select"]
[0,2,"My worrying is dangerous for me",null,null,null,null,3,null,null,null,null,null,2,null,"Do not agree",1]
[0,3,"I think a lot about my thoughts",null,null,null,null,2,null,null,null,null,null,1,null,"Agree slightly",2]
[0,4,"I could make myself sick with worrying",null,null,null,null,3,null,null,null,null,null,2,null,"Agree moderately",3]
[0,5,"I am aware of the way my mind works when I am thinking through a problem",null,null,null,null,2,null,null,null,null,null,1,null,"Agree very much",4]
[0,6,"If I did not control a worrying thought, and then it happened, it would be my fault",null,null,null,null,4,null,null,null,null,null,3]
[0,7,"I need to worry in order to remain organized",null,null,null,null,3,null,null,null,null,null,2]
[0,8,"I have little confidence in my memory for words and names",null,null,null,null,4,null,null,null,null,null,3]
[0,9,"My worrying thoughts persist, no matter how I try to stop them",null,null,null,null,3,null,null,null,null,null,2]
[0,10,"Worrying helps me to get things sorted out in my mind",null,null,null,null,3,null,null,null,null,null,2]
[0,11,"I cannot ignore my worrying thoughts",null,null,null,null,3,null,null,null,null,null,2]
[0,12,"I monitor my thoughts",null,null,null,null,2,null,null,null,null,null,1]
[0,13,"I should be in control of my thoughts all of the time",null,null,null,null,2,null,null,null,null,null,1]
[0,14,"My memory can mislead me at times",null,null,null,null,3,null,null,null,null,null,2]
[0,15,"My worrying could make me go mad",null,null,null,null,2,null,null,null,null,null,1]
[0,16,"I am constantly aware of my thinking",null,null,null,null,3,null,null,null,null,null,2]
[0,17,"I have a poor memory",null,null,null,null,2,null,null,null,null,null,1]
[0,18,"I pay close attention to the way my mind works",null,null,null,null,3,null,null,null,null,null,2]
[0,19,"Worrying helps me to cope",null,null,null,null,3,null,null,null,null,null,2]
[0,20,"Not being able to control my thoughts is a sign of weakness",null,null,null,null,2,null,null,null,null,null,1]
[0,21,"If I could not control my thoughts, I would not be able to function",null,null,null,null,2,null,null,null,null,null,1]
[0,22,"When I start worrying, I cannot stop",null,null,null,null,2,null,null,null,null,null,1]
[0,23,"I will be punished for not controlling certain thoughts",null,null,null,null,3,null,null,null,null,null,2]
[0,24,"Worrying helps me to solve problems",null,null,null,null,2,null,null,null,null,null,1]
[0,25,"I have little confidence in my memory for places",null,null,null,null,2,null,null,null,null,null,1]
[0,26,"It is bad to think certain thoughts",null,null,null,null,3,null,null,null,null,null,2]
[0,27,"I do not trust my memory",null,null,null,null,3,null,null,null,null,null,2]
[0,28,"I need to worry in order to work well",null,null,null,null,3,null,null,null,null,null,2]
[0,29,"I have little confidence in my memory for actions",null,null,null,null,2,null,null,null,null,null,1]
[0,30,"I constantly examine my thoughts",null,null,null,null,2,null,null,null,null,null,1]
[]
[]
[null,"Mini-CERTS"]
[null,"Read each item and then decide how you generally respond. Please put ONE tick for each row. Don’t agonise over individual answers, give the first response to each line that comes to mind."]
[null,"«  When thoughts about myself, feelings, situations or events do come to mind … »"]
[{"$f":"IF(H193=1,1,0)","v":0},"1. My thinking tends to get stuck in a rut, involving only a few themes. ",null,null,null,null,null,3,null,null,null,null,null,{"$f":"IF(H193=1,\"MISSING\", H193-1)","v":2},null,"Please select"]
[0,"2. I can grasp and respond to changes in the world around me without having to analyze the details",null,null,null,null,null,3,null,null,null,null,null,2,null,"Almost never"]
[0,"3. I compare myself to other people",null,null,null,null,null,4,null,null,null,null,null,3,null,"Sometimes"]
[0,"4. My thinking tends to become open, loose, expansive and creative",null,null,null,null,null,2,null,null,null,null,null,1,null,"Often"]
[0,"5. I judge myself against my own standards and beliefs",null,null,null,null,null,5,null,null,null,null,null,4,null,"Almost Always"]
[0,"6. I focus on why things happened the way they did",null,null,null,null,null,3,null,null,null,null,null,2]
[0,"7. I think about why I can’t get started on something",null,null,null,null,null,3,null,null,null,null,null,2]
[0,"8. My thoughts move in new and interesting directions ",null,null,null,null,null,3,null,null,null,null,null,2]
[0,"9. I seem to be engaged in and directly in touch with what is going on around me ",null,null,null,null,null,3,null,null,null,null,null,2]
[0,"10. I think I’m no good at all",null,null,null,null,null,2,null,null,null,null,null,1]
[0,"11. I’m relaxed about going with the flow of what comes to mind",null,null,null,null,null,4,null,null,null,null,null,3]
[0,"12. I feel under pressure to stop my worse fears happening",null,null,null,null,null,4,null,null,null,null,null,3]
[0,"13. I focus on exploring and playing with ideas, curious about where it will lead",null,null,null,null,null,3,null,null,null,null,null,2]
[0,"14. My thinking tends to spiral out from one specific event to broader, general aspects of my life ",null,null,null,null,null,3,null,null,null,null,null,2]
[0,"15. I am concerned about what other people might think of me ",null,null,null,null,null,4,null,null,null,null,null,3]
[0,"16. I have very rapid impressions and intuitions of what is happening around me ",null,null,null,null,null,3,null,null,null,null,null,2]
[]
[]
[null,"SE"]
[null,"Each of us develops beliefs about our capacity and skills in different areas. For the various areas below (as well as others that may seem relevant to you), indicate the level of confidence with which you think you can handle things with the following scale:"]
[]
[null,"To handle things means doing what needs to be done, to have the right attitude, to be able to cope. "]
[null,"I have confidence in my ability to handle things … ",null,null,null,null,null,"Please fill in a number between 0 and 100 in the boxes below.Veuillez remplir un chiffre allant de 0 à 100 dans les cases ci-dessous. If this area is not relevant to you, simply note N / A for not applicable."]
[{"$f":"IF(ISBLANK(H216),1,0)","v":0},"…in the relationships within family",null,null,null,null,null,20,null,null,null,null,null,{"$f":"(IF(ISBLANK(H216),\"MISSING\",H216))","v":20}]
[{"$f":"IF(ISBLANK(H217),1,0)","v":0},"…in the relationships within my couple",null,null,null,null,null,75,null,null,null,null,null,75]
[0,"…in the relationships with my friends",null,null,null,null,null,60,null,null,null,null,null,60]
[0,"…in my professional relationships",null,null,null,null,null,60,null,null,null,null,null,60]
[0,"…as a parent",null,null,null,null,null,85,null,null,null,null,null,85]
[0,"…in my sexual life",null,null,null,null,null,75,null,null,null,null,null,75]
[0,"…in my profession or my studies",null,null,null,null,null,65,null,null,null,null,null,65]
[0,"…in the regulation of  my emotions",null,null,null,null,null,10,null,null,null,null,null,10]
[0,"...in my free time, my hobbies",null,null,null,null,null,20,null,null,null,null,null,20]
[0,"…in daily tasks / housework",null,null,null,null,null,85,null,null,null,null,null,85]
[null,"Possibly, other(s) fields that you may consider significant(s) :"]
[{"$f":"IF(AND(ISTEXT(C227),ISBLANK(H227)),1,IF(ISBLANK(H227),0,0))","v":0},"…in",null,null,null,null,null,null,null,null,null,null,null,{"$f":"IF(AND(ISTEXT(C227),ISBLANK(H227)),\"MISSING\",IF(ISBLANK(H227),\"VIDE\",H227))","v":"VIDE"}]
[{"$f":"IF(AND(ISTEXT(C228),ISBLANK(H228)),1,IF(ISBLANK(H228),0,0))","v":0},"…in",null,null,null,null,null,null,null,null,null,null,null,{"$f":"IF(AND(ISTEXT(C228),ISBLANK(H228)),\"MISSING\",IF(ISBLANK(H228),\"VIDE\",H228))","v":"VIDE"}]
[0,"…in",null,null,null,null,null,null,null,null,null,null,null,{"$f":"IF(AND(ISTEXT(C229),ISBLANK(H229)),\"MISSING\",IF(ISBLANK(H229),\"VIDE\",H229))","v":"VIDE"}]
[]
[]
[null,"Self-discrepancies Questionnaire"]
[null,"Think for a moment and make a list of the features you would like to possess ideally and of those you definitely don’t want to have (whether or not you think to possess them). To help you, if necessary, here are some examples of possible features:"]
[]
[null,"Ideal Self"]
[null,"Features I would like to have: ",null,null,null,null,"%","Features I wouldn’t like to have :","%"]
[null,"Calm",null,null,null,null,0.25,"Unfair",0.1]
[null,"Clever",null,null,null,null,0.35,"Dishonest",0.01]
[null,"Efficient",null,null,null,null,0.5,"Disdainfull",0.1]
[null,"Liked",null,null,null,null,0.4,"Stupid",0.4]
[null,"Altruistic",null,null,null,null,0.7,"Self-important",0.1]
[]
[]
[]
[null,"For each desirable feature, indicate in the right column the extent to which you possess this feature, the ideal being 100%. For example, if you have a generosity ideal and that you think to actually possess this characteristic at 80% of your ideal, please write  « Generous : 80% ».",null,null,null,null,null,"For each undesirable feature, indicate in the right column the extent to which you possess this feature, the ideal being 0%. For example, if you dislike stinginess and that you think to possess this feature at 20%, please write « Stingy : 20% »."]
[]
[null,"Choose the correct answer."]
[null,"How big is globally the discrepancy between this ideal and the way you perceive yourself?"]
[{"$f":"IF(H249=0,1,0)","v":0},null,null,null,null,null,null,4,null,null,null,null,null,{"$f":"IF(H249=0,\"MISSING\",H249)","v":4}]
[]
[null,"How strong is the distress caused by this discrepancy?"]
[{"$f":"IF(H252=0,1,0)","v":0},null,null,null,null,null,null,3,null,null,null,null,null,{"$f":"IF(H252=0,\"MISSING\",H252)","v":3}]
[]
[null,"Think for a moment and make a list of the features that are expected from you by your relatives (regardless of whether or not you think you possess them)."]
[null,"Ought self"]
[null,"Features that the important people to me think I should have :",null,null,null,null,"%","Features that the important people to me think that I should not have :","%"]
[null,"Calm",null,null,null,null,0.3,"Unfair",0.05]
[null,"Kind",null,null,null,null,0.8,"Reckless",0.15]
[null,"Clever",null,null,null,null,0.4,"Selfish",0.1]
[null,"Altruistic",null,null,null,null,0.6,"Agressiv",0.2]
[null,"Efficient",null,null,null,null,0.5,"Extreme",0.7]
[]
[]
[]
[null,"For each desirable feature, indicate in the right column the extent to which you possess this feature, the ideal being 100%. For example, if you think that your relatives have an ideal of generosity for yourself and that you think to actually possess this characteristic at 80% of your ideal, please write  « Generous : 80% ».",null,null,null,null,null,"For each undesirable feature, indicate in the right column the extent to which you possess this feature, the ideal being 0%. For example, if your relatives dislike you being stingy and that you think to actually possess this feature at 20%, please write « Stingy : 20% »."]
[]
[null,"Choose the correct answer."]
[null,"How big is globally the discrepancy between this ideal and the way you perceive yourself?"]
[]
[{"$f":"IF(H270=0,1,0)","v":0},null,null,null,null,null,null,5,null,null,null,null,null,{"$f":"IF(H270=0,\"MISSING\",H270)","v":5}]
[]
[null,"How strong is the distress caused by this discrepancy?"]
[{"$f":"IF(H273=0,1,0)","v":0},null,null,null,null,null,null,4,null,null,null,null,null,{"$f":"IF(H273=0,\"MISSING\",H273)","v":4}]
[]
[null,"This survey is over. Thank you for your time. Before exiting, don't forfet to save the file in a definite location on your computer. Then you can send it back my mail (with attached file) to the contact person."]

{"sheet":"Therapist","index":3,"n_rows":459,"n_cols":30,"rows_kept":459,"cut":false,"hidden":false,"merged":[[457,1,457,10],[458,1,458,10],[18,2,18,4],[19,2,19,4],[20,2,20,4],[452,1,452,10],[453,1,453,10],[454,1,454,10],[455,1,455,10],[456,1,456,10],[447,1,447,10],[448,1,448,10],[449,1,449,10],[450,1,450,10],[451,1,451,10],[442,1,442,10],[443,1,443,10],[444,1,444,10],[445,1,445,10],[446,1,446,10],[437,1,437,10],[438,1,438,10],[439,1,439,10],[440,1,440,10],[441,1,441,10],[432,1,432,10],[433,1,433,10],[434,1,434,10],[435,1,435,10],[436,1,436,10],[427,1,427,10],[428,1,428,10],[429,1,429,10],[430,1,430,10],[431,1,431,10],[422,1,422,10],[423,1,423,10],[424,1,424,10],[425,1,425,10],[426,1,426,10],[417,1,417,10],[418,1,418,10],[419,1,419,10],[420,1,420,10],[421,1,421,10],[412,1,412,10],[413,1,413,10],[414,1,414,10],[415,1,415,10],[416,1,416,10],[407,1,407,10],[408,1,408,10],[409,1,409,10],[410,1,410,10],[411,1,411,10],[402,1,402,10],[403,1,403,10],[404,1,404,10],[405,1,405,10],[406,1,406,10],[397,1,397,10],[398,1,398,10],[399,1,399,10],[400,1,400,10],[401,1,401,10],[392,1,392,10],[393,1,393,10],[394,1,394,10],[395,1,395,10],[396,1,396,10],[387,1,387,10],[388,1,388,10],[389,1,389,10],[390,1,390,10],[391,1,391,10],[382,1,382,10],[383,1,383,10],[384,1,384,10],[385,1,385,10],[386,1,386,10],[377,1,377,10],[378,1,378,10],[379,1,379,10],[380,1,380,10],[381,1,381,10],[372,1,372,10],[373,1,373,10],[374,1,374,10],[375,1,375,10],[376,1,376,10],[367,1,367,10],[368,1,368,10],[369,1,369,10],[370,1,370,10],[371,1,371,10],[362,1,362,10],[363,1,363,10],[364,1,364,10],[365,1,365,10],[366,1,366,10],[357,1,357,10],[358,1,358,10],[359,1,359,10],[360,1,360,10],[361,1,361,10],[352,1,352,10],[353,1,353,10],[354,1,354,10],[355,1,355,10],[356,1,356,10],[347,1,347,10],[348,1,348,10],[349,1,349,10],[350,1,350,10],[351,1,351,10],[342,1,342,10],[343,1,343,10],[344,1,344,10],[345,1,345,10],[346,1,346,10],[337,1,337,10],[338,1,338,10],[339,1,339,10],[340,1,340,10],[341,1,341,10],[332,1,332,10],[333,1,333,10],[334,1,334,10],[335,1,335,10],[336,1,336,10],[327,1,327,10],[328,1,328,10],[329,1,329,10],[330,1,330,10],[331,1,331,10],[322,1,322,10],[323,1,323,10],[324,1,324,10],[325,1,325,10],[326,1,326,10],[317,1,317,10],[318,1,318,10],[319,1,319,10],[320,1,320,10],[321,1,321,10],[312,1,312,10],[313,1,313,10],[314,1,314,10],[315,1,315,10],[316,1,316,10],[307,1,307,10],[308,1,308,10],[309,1,309,10],[310,1,310,10],[311,1,311,10],[302,1,302,10],[303,1,303,10],[304,1,304,10],[305,1,305,10],[306,1,306,10],[297,1,297,10],[298,1,298,10],[299,1,299,10],[300,1,300,10],[301,1,301,10],[292,1,292,10],[293,1,293,10],[294,1,294,10],[295,1,295,10],[296,1,296,10],[287,1,287,10],[288,1,288,10],[289,1,289,10],[290,1,290,10],[291,1,291,10],[282,1,282,10],[283,1,283,10],[284,1,284,10],[285,1,285,10],[286,1,286,10],[277,1,277,10],[278,1,278,10],[279,1,279,10],[280,1,280,10],[281,1,281,10],[272,1,272,10],[273,1,273,10],[274,1,274,10],[275,1,275,10],[276,1,276,10],[267,1,267,10],[268,1,268,10],[269,1,269,10],[270,1,270,10],[271,1,271,10],[262,1,262,10],[263,1,263,10],[264,1,264,10],[265,1,265,10],[266,1,266,10],[257,1,257,10],[258,1,258,10],[259,1,259,10],[260,1,260,10],[261,1,261,10],[252,1,252,10],[253,1,253,10],[254,1,254,10],[255,1,255,10],[256,1,256,10],[247,1,247,10],[248,1,248,10],[249,1,249,10],[250,1,250,10],[251,1,251,10],[242,1,242,10],[243,1,243,10],[244,1,244,10],[245,1,245,10],[246,1,246,10],[237,1,237,10],[238,1,238,10],[239,1,239,10],[240,1,240,10],[241,1,241,10],[232,1,232,10],[233,1,233,10],[234,1,234,10],[235,1,235,10],[236,1,236,10],[227,1,227,10],[228,1,228,10],[229,1,229,10],[230,1,230,10],[231,1,231,10],[222,1,222,10],[223,1,223,10],[224,1,224,10],[225,1,225,10],[226,1,226,10],[217,1,217,10],[218,1,218,10],[219,1,219,10],[220,1,220,10],[221,1,221,10],[212,1,212,10],[213,1,213,10],[214,1,214,10],[215,1,215,10],[216,1,216,10],[207,1,207,10],[208,1,208,10],[209,1,209,10],[210,1,210,10],[211,1,211,10],[202,1,202,10],[203,1,203,10],[204,1,204,10],[205,1,205,10],[206,1,206,10],[197,1,197,10],[198,1,198,10],[199,1,199,10],[200,1,200,10],[201,1,201,10],[192,1,192,10],[193,1,193,10],[194,1,194,10],[195,1,195,10],[196,1,196,10],[187,1,187,10],[188,1,188,10],[189,1,189,10],[190,1,190,10],[191,1,191,10],[182,1,182,10],[183,1,183,10],[184,1,184,10],[185,1,185,10],[186,1,186,10],[177,1,177,10],[178,1,178,10],[179,1,179,10],[180,1,180,10],[181,1,181,10],[172,1,172,10],[173,1,173,10],[174,1,174,10],[175,1,175,10],[176,1,176,10],[167,1,167,10],[168,1,168,10],[169,1,169,10],[170,1,170,10],[171,1,171,10],[162,1,162,10],[163,1,163,10],[164,1,164,10],[165,1,165,10],[166,1,166,10],[157,1,157,10],[158,1,158,10],[159,1,159,10],[160,1,160,10],[161,1,161,10],[152,1,152,10],[153,1,153,10],[154,1,154,10],[155,1,155,10],[156,1,156,10],[147,1,147,10],[148,1,148,10],[149,1,149,10],[150,1,150,10],[151,1,151,10],[142,1,142,10],[143,1,143,10],[144,1,144,10],[145,1,145,10],[146,1,146,10],[137,1,137,10],[138,1,138,10],[139,1,139,10],[140,1,140,10],[141,1,141,10],[132,1,132,10],[133,1,133,10],[134,1,134,10],[135,1,135,10],[136,1,136,10],[127,1,127,10],[128,1,128,10],[129,1,129,10],[130,1,130,10],[131,1,131,10],[122,1,122,10],[123,1,123,10],[124,1,124,10],[125,1,125,10],[126,1,126,10],[117,1,117,10],[118,1,118,10],[119,1,119,10],[120,1,120,10],[121,1,121,10],[112,1,112,10],[113,1,113,10],[114,1,114,10],[115,1,115,10],[116,1,116,10],[107,1,107,10],[108,1,108,10],[109,1,109,10],[110,1,110,10],[111,1,111,10],[102,1,102,10],[103,1,103,10],[104,1,104,10],[105,1,105,10],[106,1,106,10],[97,1,97,10],[98,1,98,10],[99,1,99,10],[100,1,100,10],[101,1,101,10],[92,1,92,10],[93,1,93,10],[94,1,94,10],[95,1,95,10],[96,1,96,10],[87,1,87,10],[88,1,88,10],[89,1,89,10],[90,1,90,10],[91,1,91,10],[82,1,82,10],[83,1,83,10],[84,1,84,10],[85,1,85,10],[86,1,86,10],[77,1,77,10],[78,1,78,10],[79,1,79,10],[80,1,80,10],[81,1,81,10],[72,1,72,10],[73,1,73,10],[74,1,74,10],[75,1,75,10],[76,1,76,10],[67,1,67,10],[68,1,68,10],[69,1,69,10],[70,1,70,10],[71,1,71,10],[62,1,62,10],[63,1,63,10],[64,1,64,10],[65,1,65,10],[66,1,66,10],[57,1,57,10],[58,1,58,10],[59,1,59,10],[60,1,60,10],[61,1,61,10],[52,1,52,10],[53,1,53,10],[54,1,54,10],[55,1,55,10],[56,1,56,10],[47,1,47,10],[48,1,48,10],[49,1,49,10],[50,1,50,10],[51,1,51,10],[42,1,42,10],[43,1,43,10],[44,1,44,10],[45,1,45,10],[46,1,46,10],[37,1,37,10],[38,1,38,10],[39,1,39,10],[40,1,40,10],[41,1,41,10],[3,1,3,2],[3,3,3,4],[29,1,30,1],[31,1,32,1],[33,1,34,1],[28,1,28,13],[5,1,5,4],[25,1,25,4],[8,1,8,4],[11,1,11,4],[14,1,14,4],[17,1,17,4],[22,1,22,2],[22,3,22,4]]}
[]
[null,"To be filled in by the therapist:"]
[null,null,null,null,null,null,null,null,null,null,null,null,null,null,null,null,null,"Réponse"]
[{"$f":"IF('Quest T1'!E7=1,1,0)","v":0},"Age",null,1,null,null,null,null,null,null,null,null,null,null,null,null,null,{"$f":"IF('Quest T1'!E7=1,\"MANQUANT\", 'Quest T1'!E7-1)","v":33}]
[]
[null,"Sex"]
[{"$f":"IF('Quest T1'!C10=1,1,0)","v":0},1,null,null,null,null,null,null,null,null,null,null,null,null,null,null,null,{"$f":"IF('Quest T1'!C10=1,\"MANQUANT\", 'Quest T1'!C10-2)","v":0}]
[]
[null,"Niveau d’étude"]
[{"$f":"IF('Quest T1'!C13=1,1,0)","v":0},1,null,null,null,null,null,null,null,null,null,null,null,null,null,null,null,{"$f":"IF('Quest T1'!C13=1,\"MANQUANT\", 'Quest T1'!C13-1)","v":5}]
[]
[null,"Statut professionnel "]
[{"$f":"IF('Quest T1'!C16=1,1,0)","v":0},1,null,null,null,null,null,null,null,null,null,null,null,null,null,null,null,{"$f":"IF('Quest T1'!C16=1,\"MANQUANT\", 'Quest T1'!C16-1)","v":3}]
[]
[null,"Statut familial"]
[{"$f":"IF('Quest T1'!C19=1,1,0)","v":0},1,null,null,null,null,null,null,null,null,null,null,null,null,null,null,null,{"$f":"IF('Quest T1'!C19=1,\"MANQUANT\", 'Quest T1'!C19-1)","v":3}]
[]
[{"$f":"IF(OR(ISBLANK(C19),ISBLANK(C20)),1,0)","v":1},"Place of Counselling"]
[{"$f":"IF(B19=1,1,0)","v":0},"Country",null,null,null,null,null,null,null,null,null,null,null,null,null,null,null,{"$f":"IF(OR(ISBLANK(C19),ISBLANK(C20)),\"MANQUANT\", CONCATENATE(C19,\"; \",C20,\"; \",C21))","v":"MANQUANT"}]
[null,"City"]
[null,"Institution"]
[]
[{"$f":"IF(ISBLANK(D23),1,0)","v":1},"Identification number",null,null,null,null,null,null,null,null,null,null,null,null,null,null,null,{"$f":"IF(ISBLANK(D23),\"MANQUANT\", D23)","v":"MANQUANT"}]
[null,"(optional)"]
[]
[null,"Population "]
[{"$f":"IF(B27=1,1,0)","v":0},3,null,null,null,null,null,null,null,null,null,null,null,null,null,null,null,{"$f":"IF(B27=1,\"MANQUANT\", B27-2)","v":1},null,null,null,"Please select"]
[null,null,null,null,null,null,null,null,null,null,null,null,null,null,null,null,null,null,null,null,null,"Control",0]
[null,"Diagnosis (DSM-IV-TR)",null,null,null,null,null,null,null,null,null,null,null,null,null,null,null,null,null,null,null,"Clinic",1]
[{"$f":"IF(D30=1,1,0)","v":0},"Primaire","Code",213,null,null,null,1,null,null,null,null,null,null,null,null,null,{"$f":"IF(D30=1,\"MANQUANT\",VLOOKUP(D30-1,$AB$33:$AD$453,3))","v":"300.21 "}]
[0,null,"Intensité",7,null,null,null,null,null,null,null,null,null,null,null,null,null,{"$f":"IF(D31=1,\"MANQUANT\", D31-2)","v":5},null,null,null,"Please select the intensity of the disorder"]
[1,"Secondaire","Code",1,null,null,null,null,null,null,null,null,null,null,null,null,null,{"$f":"IF(D32=1,\"MANQUANT\",VLOOKUP(D32-1,$AB$33:$AD$453,3))","v":"MANQUANT"},null,null,0,"0 : the disorder doesn't cause any impairement",null,null,null,null,null,null,"Please select the DSM code"]
[1,null,"Intensité",1,null,null,null,null,null,null,null,null,null,null,null,null,null,{"$f":"IF(D33=1,\"MANQUANT\", D33-2)","v":"MANQUANT"},null,null,1,1,null,null,null,null,null,1,"290.40  -  Vascular Dementia, Uncomplicated","290.40"]
[1,"Tertiaire","Code",1,null,null,null,null,null,null,null,null,null,null,null,null,null,{"$f":"IF(D34=1,\"MANQUANT\",VLOOKUP(D34-1,$AB$33:$AD$453,3))","v":"MANQUANT"},null,null,2,"2 : the disorder slighly interferes with some professional, social or familial activities; it causes dyscomfort for the individual.",null,null,null,null,null,2,"290.41   -  Vascular Dementia, With Delirium","290.41 "]
[1,null,"Intensité",1,null,null,null,null,null,null,null,null,null,null,null,null,null,{"$f":"IF(D35=1,\"MANQUANT\", D35-2)","v":"MANQUANT"},null,null,3,3,null,null,null,null,null,3,"290.42   -  Vascular Dementia, With Delusions","290.42 "]
[null,null,null,null,null,null,null,null,null,null,null,null,null,null,null,null,null,null,null,null,4,"4 : the disorder is an obstacle for some important professional, social or familial activities; it causes suffering to the individual and his/her relatives.",null,null,null,null,null,4,"290.43  -  Vascular Dementia, With Depressed Mood","290.43"]
[null,null,null,null,null,null,null,null,null,null,null,null,null,null,null,null,null,null,null,null,5,5,null,null,null,null,null,5,"291.0   -  Alcohol Intoxication Delirium","291.0 "]
[null,"List of diagnosis (You can click on the arrow on the right to search. Then fill in the fields above. Don't click on cancel)",null,null,null,null,null,null,null,null,null,null,null,null,null,null,null,null,null,null,6,"6 : the disorder prevent the individual to realize important professional, social of familial activities; it causes important suffering to the individuel and his/her relatives",null,null,null,null,null,6,"291.0   -  Alcohol Withdrawal Delirium","291.0 "]
[null,"290.40  -  Vascular Dementia, Uncomplicated",null,null,null,null,null,null,null,null,null,null,null,null,null,null,null,null,null,null,7,7,null,null,null,null,null,7,"291.1   -  Alcohol-Induced Persisting Amnestic Disorder","291.1 "]
[null,"290.41   -  Vascular Dementia, With Delirium",null,null,null,null,null,null,null,null,null,null,null,null,null,null,null,null,null,null,8,"8 : the disorder requires hospitalization or institutional placement",null,null,null,null,null,8,"291.2   -  Alcohol-Induced Persisting Dementia","291.2 "]
[null,"290.42   -  Vascular Dementia, With Delusions",null,null,null,null,null,null,null,null,null,null,null,null,null,null,null,null,null,null,null,null,null,null,null,null,null,9,"291.3   -  Alcohol-Induced Induced Psychotic Disorder, WithHallucinations","291.3 "]
[null,"290.43  -  Vascular Dementia, With Depressed Mood",null,null,null,null,null,null,null,null,null,null,null,null,null,null,null,null,null,null,null,null,null,null,null,null,null,10,"291.5   -  Alcohol-Induced Psychotic Disorder, With Delusions","291.5 "]
[null,"291.0   -  Alcohol Intoxication Delirium",null,null,null,null,null,null,null,null,null,null,null,null,null,null,null,null,null,null,null,null,null,null,null,null,null,11,"291.81  -  Alcohol Withdrawal (new code as of 10/01/96)","291.81"]
[null,"291.0   -  Alcohol Withdrawal Delirium",null,null,null,null,null,null,null,null,null,null,null,null,null,null,null,null,null,null,null,null,null,null,null,null,null,12,"291.82  -  Alcohol-Induced Sleep Disorder (new code as of 10.01.2005)","291.82"]
[null,"291.1   -  Alcohol-Induced Persisting Amnestic Disorder",null,null,null,null,null,null,null,null,null,null,null,null,null,null,null,null,null,null,null,null,null,null,null,null,null,13,"291.89  -  Alcohol-Induced Anxiety Disorder (new code as of 10/01/96)","291.89"]
[null,"291.2   -  Alcohol-Induced Persisting Dementia",null,null,null,null,null,null,null,null,null,null,null,null,null,null,null,null,null,null,null,null,null,null,null,null,null,14,"291.89  -  Alcohol-Induced Mood Disorder (new code as of 10/01/96)","291.89"]
[null,"291.3   -  Alcohol-Induced Induced Psychotic Disorder, WithHallucinations",null,null,null,null,null,null,null,null,null,null,null,null,null,null,null,null,null,null,null,null,null,null,null,null,null,15,"291.89  -  Alcohol-Induced Sexual Dysfunction  (new code as of 10/01/96)","291.89"]
[null,"291.5   -  Alcohol-Induced Psychotic Disorder, With Delusions",null,null,null,null,null,null,null,null,null,null,null,null,null,null,null,null,null,null,null,null,null,null,null,null,null,16,"291.89  -  Alcohol-Induced Sleep Disorder (10.01.1996-10.01.2005)","291.89"]
[null,"291.81  -  Alcohol Withdrawal (new code as of 10/01/96)",null,null,null,null,null,null,null,null,null,null,null,null,null,null,null,null,null,null,null,null,null,null,null,null,null,17,"291.9   -  Alcohol-Related Disorder NOS","291.9 "]
[null,"291.82  -  Alcohol-Induced Sleep Disorder (new code as of 10.01.2005)",null,null,null,null,null,null,null,null,null,null,null,null,null,null,null,null,null,null,null,null,null,null,null,null,null,18,"292.0   -  Amphetamine Withdrawal","292.0 "]
[null,"291.89  -  Alcohol-Induced Anxiety Disorder (new code as of 10/01/96)",null,null,null,null,null,null,null,null,null,null,null,null,null,null,null,null,null,null,null,null,null,null,null,null,null,19,"292.0  -  Cocaine Withdrawal","292.0"]
[null,"291.89  -  Alcohol-Induced Mood Disorder (new code as of 10/01/96)",null,null,null,null,null,null,null,null,null,null,null,null,null,null,null,null,null,null,null,null,null,null,null,null,null,20,"292.0  -  Nicotine Withdrawal","292.0"]
[null,"291.89  -  Alcohol-Induced Sexual Dysfunction  (new code as of 10/01/96)",null,null,null,null,null,null,null,null,null,null,null,null,null,null,null,null,null,null,null,null,null,null,null,null,null,21,"292.0   -  Opioid Withdrawal","292.0 "]
[null,"291.89  -  Alcohol-Induced Sleep Disorder (10.01.1996-10.01.2005)",null,null,null,null,null,null,null,null,null,null,null,null,null,null,null,null,null,null,null,null,null,null,null,null,null,22,"292.0   -  Other (or Unknown) Substance Withdrawal","292.0 "]
[null,"291.9   -  Alcohol-Related Disorder NOS",null,null,null,null,null,null,null,null,null,null,null,null,null,null,null,null,null,null,null,null,null,null,null,null,null,23,"292.0   -  Sedative, Hypnotic, or Anxiolytic Withdrawal","292.0 "]
[null,"292.0   -  Amphetamine Withdrawal",null,null,null,null,null,null,null,null,null,null,null,null,null,null,null,null,null,null,null,null,null,null,null,null,null,24,"292.11   -  Amphetamine-Induced Psychotic Disorder, WithDelusions","292.11 "]
[null,"292.0  -  Cocaine Withdrawal",null,null,null,null,null,null,null,null,null,null,null,null,null,null,null,null,null,null,null,null,null,null,null,null,null,25,"292.11   -  Cannabis-Induced Psychotic Disorder, With Delusions","292.11 "]
[null,"292.0  -  Nicotine Withdrawal",null,null,null,null,null,null,null,null,null,null,null,null,null,null,null,null,null,null,null,null,null,null,null,null,null,26,"292.11   -  Cocaine-Induced Psychotic Disorder, With Delusions","292.11 "]
[null,"292.0   -  Opioid Withdrawal",null,null,null,null,null,null,null,null,null,null,null,null,null,null,null,null,null,null,null,null,null,null,null,null,null,27,"292.11   -  Hallucinogen-Induced Psychotic Disorder, WithDelusions","292.11 "]
[null,"292.0   -  Other (or Unknown) Substance Withdrawal",null,null,null,null,null,null,null,null,null,null,null,null,null,null,null,null,null,null,null,null,null,null,null,null,null,28,"292.11  -  Inhalant-Induced Psychotic Disorder, With Delusions","292.11"]
[null,"292.0   -  Sedative, Hypnotic, or Anxiolytic Withdrawal",null,null,null,null,null,null,null,null,null,null,null,null,null,null,null,null,null,null,null,null,null,null,null,null,null,29,"292.11   -  Opioid-Induced Psychotic Disorder, With Delusions","292.11 "]
[null,"292.11   -  Amphetamine-Induced Psychotic Disorder, WithDelusions",null,null,null,null,null,null,null,null,null,null,null,null,null,null,null,null,null,null,null,null,null,null,null,null,null,30,"292.11   -  Other (or Unknown) Substance Induced Psychotic Disorder, With Delusions","292.11 "]
[null,"292.11   -  Cannabis-Induced Psychotic Disorder, With Delusions",null,null,null,null,null,null,null,null,null,null,null,null,null,null,null,null,null,null,null,null,null,null,null,null,null,31,"292.11   -  Phencyclidine-Induced Psychotic Disorder, WithDelusions","292.11 "]
[null,"292.11   -  Cocaine-Induced Psychotic Disorder, With Delusions",null,null,null,null,null,null,null,null,null,null,null,null,null,null,null,null,null,null,null,null,null,null,null,null,null,32,"292.11   -  Sedative, Hypnotic, or Anxiolytic-Induced Psychotic Disorder, With Delusions","292.11 "]
[null,"292.11   -  Hallucinogen-Induced Psychotic Disorder, WithDelusions",null,null,null,null,null,null,null,null,null,null,null,null,null,null,null,null,null,null,null,null,null,null,null,null,null,33,"292.12   -  Amphetamine-Induced Psychotic Disorder, WithHallucinations","292.12 "]
[null,"292.11  -  Inhalant-Induced Psychotic Disorder, With Delusions",null,null,null,null,null,null,null,null,null,null,null,null,null,null,null,null,null,null,null,null,null,null,null,null,null,34,"292.12   -  Cannabis-Induced Psychotic Disorder, WithHallucinations","292.12 "]
[null,"292.11   -  Opioid-Induced Psychotic Disorder, With Delusions",null,null,null,null,null,null,null,null,null,null,null,null,null,null,null,null,null,null,null,null,null,null,null,null,null,35,"292.12   -  Cocaine-Induced Psychotic Disorder, WithHallucinations","292.12 "]
[null,"292.11   -  Other (or Unknown) Substance Induced Psychotic Disorder, With Delusions",null,null,null,null,null,null,null,null,null,null,null,null,null,null,null,null,null,null,null,null,null,null,null,null,null,36,"292.12   -  Hallucinogen-Induced Psychotic Disorder, WithHallucinations","292.12 "]
[null,"292.11   -  Phencyclidine-Induced Psychotic Disorder, WithDelusions",null,null,null,null,null,null,null,null,null,null,null,null,null,null,null,null,null,null,null,null,null,null,null,null,null,37,"292.12   -  Inhalant-Induced Psychotic Disorder, WithHallucinations","292.12 "]
[null,"292.11   -  Sedative, Hypnotic, or Anxiolytic-Induced Psychotic Disorder, With Delusions",null,null,null,null,null,null,null,null,null,null,null,null,null,null,null,null,null,null,null,null,null,null,null,null,null,38,"292.12   -  Opioid-Induced Psychotic Disorder, WithHallucinations","292.12 "]
[null,"292.12   -  Amphetamine-Induced Psychotic Disorder, WithHallucinations",null,null,null,null,null,null,null,null,null,null,null,null,null,null,null,null,null,null,null,null,null,null,null,null,null,39,"292.12   -  Other (or Unknown) Substance-Induced Psychotic Disorder, With Hallucinations","292.12 "]
[null,"292.12   -  Cannabis-Induced Psychotic Disorder, WithHallucinations",null,null,null,null,null,null,null,null,null,null,null,null,null,null,null,null,null,null,null,null,null,null,null,null,null,40,"292.12   -  Phencyclidine-Induced Psychotic Disorder, WithHallucinations","292.12 "]
[null,"292.12   -  Cocaine-Induced Psychotic Disorder, WithHallucinations",null,null,null,null,null,null,null,null,null,null,null,null,null,null,null,null,null,null,null,null,null,null,null,null,null,41,"292.12   -  Sedative, Hypnotic, or Anxiolytic-Induced Psychotic Disorder, With Hallucinations","292.12 "]
[null,"292.12   -  Hallucinogen-Induced Psychotic Disorder, WithHallucinations",null,null,null,null,null,null,null,null,null,null,null,null,null,null,null,null,null,null,null,null,null,null,null,null,null,42,"292.81   -  Amphetamine Intoxication Delirium","292.81 "]
[null,"292.12   -  Inhalant-Induced Psychotic Disorder, WithHallucinations",null,null,null,null,null,null,null,null,null,null,null,null,null,null,null,null,null,null,null,null,null,null,null,null,null,43,"292.81   -  Cannabis Intoxication Delirium","292.81 "]
[null,"292.12   -  Opioid-Induced Psychotic Disorder, WithHallucinations",null,null,null,null,null,null,null,null,null,null,null,null,null,null,null,null,null,null,null,null,null,null,null,null,null,44,"292.81   -  Cocaine Intoxication Delirium","292.81 "]
[null,"292.12   -  Other (or Unknown) Substance-Induced Psychotic Disorder, With Hallucinations",null,null,null,null,null,null,null,null,null,null,null,null,null,null,null,null,null,null,null,null,null,null,null,null,null,45,"292.81   -  Hallucinogen Intoxication Delirium","292.81 "]
[null,"292.12   -  Phencyclidine-Induced Psychotic Disorder, WithHallucinations",null,null,null,null,null,null,null,null,null,null,null,null,null,null,null,null,null,null,null,null,null,null,null,null,null,46,"292.81  -  Inhalant Intoxication Delirium","292.81"]
[null,"292.12   -  Sedative, Hypnotic, or Anxiolytic-Induced Psychotic Disorder, With Hallucinations",null,null,null,null,null,null,null,null,null,null,null,null,null,null,null,null,null,null,null,null,null,null,null,null,null,47,"292.81   -  Opioid Intoxication Delirium","292.81 "]
[null,"292.81   -  Amphetamine Intoxication Delirium",null,null,null,null,null,null,null,null,null,null,null,null,null,null,null,null,null,null,null,null,null,null,null,null,null,48,"292.81   -  Other (or Unknown) Intoxication Delirium","292.81 "]
[null,"292.81   -  Cannabis Intoxication Delirium",null,null,null,null,null,null,null,null,null,null,null,null,null,null,null,null,null,null,null,null,null,null,null,null,null,49,"292.81   -  Phencyclidine Intoxication Delirium","292.81 "]
[null,"292.81   -  Cocaine Intoxication Delirium",null,null,null,null,null,null,null,null,null,null,null,null,null,null,null,null,null,null,null,null,null,null,null,null,null,50,"292.81   -  Sedative, Hypnotic, or Anxiolytic Intoxication Delirium","292.81 "]
[null,"292.81   -  Hallucinogen Intoxication Delirium",null,null,null,null,null,null,null,null,null,null,null,null,null,null,null,null,null,null,null,null,null,null,null,null,null,51,"292.81   -  Sedative, Hypnotic, or Anxiolytic Withdrawal Delirium","292.81 "]
[null,"292.81  -  Inhalant Intoxication Delirium",null,null,null,null,null,null,null,null,null,null,null,null,null,null,null,null,null,null,null,null,null,null,null,null,null,52,"292.82   -  Inhalant-Induced Persisting Dementia","292.82 "]
[null,"292.81   -  Opioid Intoxication Delirium",null,null,null,null,null,null,null,null,null,null,null,null,null,null,null,null,null,null,null,null,null,null,null,null,null,53,"292.82   -  Other (or Unknown) Substance-Induced Persisting Dementia","292.82 "]
[null,"292.81   -  Other (or Unknown) Intoxication Delirium",null,null,null,null,null,null,null,null,null,null,null,null,null,null,null,null,null,null,null,null,null,null,null,null,null,54,"292.82   -  Sedative, Hypnotic, or Anxiolytic-Induced Persisting Dementia","292.82 "]
[null,"292.81   -  Phencyclidine Intoxication Delirium",null,null,null,null,null,null,null,null,null,null,null,null,null,null,null,null,null,null,null,null,null,null,null,null,null,55,"292.83   -  Other (or Unknown) Substance-Induced Persisting Amnestic Disorder","292.83 "]
[null,"292.81   -  Sedative, Hypnotic, or Anxiolytic Intoxication Delirium",null,null,null,null,null,null,null,null,null,null,null,null,null,null,null,null,null,null,null,null,null,null,null,null,null,56,"292.83   -  Sedative, Hypnotic, or Anxiolytic-Induced Persisting Amnestic Disorder","292.83 "]
[null,"292.81   -  Sedative, Hypnotic, or Anxiolytic Withdrawal Delirium",null,null,null,null,null,null,null,null,null,null,null,null,null,null,null,null,null,null,null,null,null,null,null,null,null,57,"292.84   -  Amphetamine-Induced Mood Disorder","292.84 "]
[null,"292.82   -  Inhalant-Induced Persisting Dementia",null,null,null,null,null,null,null,null,null,null,null,null,null,null,null,null,null,null,null,null,null,null,null,null,null,58,"292.84   -  Cocaine-Induced Mood Disorder","292.84 "]
[null,"292.82   -  Other (or Unknown) Substance-Induced Persisting Dementia",null,null,null,null,null,null,null,null,null,null,null,null,null,null,null,null,null,null,null,null,null,null,null,null,null,59,"292.84   -  Hallucinogen-Induced Mood Disorder","292.84 "]
[null,"292.82   -  Sedative, Hypnotic, or Anxiolytic-Induced Persisting Dementia",null,null,null,null,null,null,null,null,null,null,null,null,null,null,null,null,null,null,null,null,null,null,null,null,null,60,"292.84   -  Inhalant-Induced Mood Disorder","292.84 "]
[null,"292.83   -  Other (or Unknown) Substance-Induced Persisting Amnestic Disorder",null,null,null,null,null,null,null,null,null,null,null,null,null,null,null,null,null,null,null,null,null,null,null,null,null,61,"292.84   -  Opioid-Induced Mood Disorder","292.84 "]
[null,"292.83   -  Sedative, Hypnotic, or Anxiolytic-Induced Persisting Amnestic Disorder",null,null,null,null,null,null,null,null,null,null,null,null,null,null,null,null,null,null,null,null,null,null,null,null,null,62,"292.84   -  Other (or Unknown) Substance-Induced Mood Disorder","292.84 "]
[null,"292.84   -  Amphetamine-Induced Mood Disorder",null,null,null,null,null,null,null,null,null,null,null,null,null,null,null,null,null,null,null,null,null,null,null,null,null,63,"292.84   -  Phencyclidine-Induced Mood Disorder","292.84 "]
[null,"292.84   -  Cocaine-Induced Mood Disorder",null,null,null,null,null,null,null,null,null,null,null,null,null,null,null,null,null,null,null,null,null,null,null,null,null,64,"292.84   -  Sedative, Hypnotic, or Anxiolytic-Induced Mood Disorder","292.84 "]
[null,"292.84   -  Hallucinogen-Induced Mood Disorder",null,null,null,null,null,null,null,null,null,null,null,null,null,null,null,null,null,null,null,null,null,null,null,null,null,65,"292.85  -  Amphetamine-Induced Sleep Disorder (new code as of 10.01.2005)","292.85"]
[null,"292.84   -  Inhalant-Induced Mood Disorder",null,null,null,null,null,null,null,null,null,null,null,null,null,null,null,null,null,null,null,null,null,null,null,null,null,66,"292.85  -  Caffeine-Induced Sleep Disorder (new code as of 10.01.2005)","292.85"]
[null,"292.84   -  Opioid-Induced Mood Disorder",null,null,null,null,null,null,null,null,null,null,null,null,null,null,null,null,null,null,null,null,null,null,null,null,null,67,"292.85  -  Cocaine-Induced Sleep Disorder (new code as of 10.01.2005)","292.85"]
[null,"292.84   -  Other (or Unknown) Substance-Induced Mood Disorder",null,null,null,null,null,null,null,null,null,null,null,null,null,null,null,null,null,null,null,null,null,null,null,null,null,68,"292.85  -  Opioid-Induced Sleep Disorder (new code as of 10.01.2005)","292.85"]
[null,"292.84   -  Phencyclidine-Induced Mood Disorder",null,null,null,null,null,null,null,null,null,null,null,null,null,null,null,null,null,null,null,null,null,null,null,null,null,69,"292.85  -  Other (or Unknown) Substance-Induced Sleep Disorder (new code as of 10.01.2005)","292.85"]
[null,"292.84   -  Sedative, Hypnotic, or Anxiolytic-Induced Mood Disorder",null,null,null,null,null,null,null,null,null,null,null,null,null,null,null,null,null,null,null,null,null,null,null,null,null,70,"292.85  -  Sedative, Hypnotic, or Anxiolytic-Induced Sleep Disorder (new code as of 10.01.2005)","292.85"]
[null,"292.85  -  Amphetamine-Induced Sleep Disorder (new code as of 10.01.2005)",null,null,null,null,null,null,null,null,null,null,null,null,null,null,null,null,null,null,null,null,null,null,null,null,null,71,"292.89   -  Amphetamine-Induced Anxiety Disorder","292.89 "]
[null,"292.85  -  Caffeine-Induced Sleep Disorder (new code as of 10.01.2005)",null,null,null,null,null,null,null,null,null,null,null,null,null,null,null,null,null,null,null,null,null,null,null,null,null,72,"292.89   -  Amphetamine-Induced Sexual Dysfunction","292.89 "]
[null,"292.85  -  Cocaine-Induced Sleep Disorder (new code as of 10.01.2005)",null,null,null,null,null,null,null,null,null,null,null,null,null,null,null,null,null,null,null,null,null,null,null,null,null,73,"292.89   -  Amphetamine-Induced Sleep Disorder (before 10.01.2005)","292.89 "]
[null,"292.85  -  Opioid-Induced Sleep Disorder (new code as of 10.01.2005)",null,null,null,null,null,null,null,null,null,null,null,null,null,null,null,null,null,null,null,null,null,null,null,null,null,74,"292.89   -  Amphetamine Intoxication","292.89 "]
[null,"292.85  -  Other (or Unknown) Substance-Induced Sleep Disorder (new code as of 10.01.2005)",null,null,null,null,null,null,null,null,null,null,null,null,null,null,null,null,null,null,null,null,null,null,null,null,null,75,"292.89   -  Caffeine-Induced Anxiety Disorder","292.89 "]
[null,"292.85  -  Sedative, Hypnotic, or Anxiolytic-Induced Sleep Disorder (new code as of 10.01.2005)",null,null,null,null,null,null,null,null,null,null,null,null,null,null,null,null,null,null,null,null,null,null,null,null,null,76,"292.89   -  Caffeine-Induced Sleep Disorder (before 10.01.2005)","292.89 "]
[null,"292.89   -  Amphetamine-Induced Anxiety Disorder",null,null,null,null,null,null,null,null,null,null,null,null,null,null,null,null,null,null,null,null,null,null,null,null,null,77,"292.89   -  Cannabis-Induced Anxiety Disorder","292.89 "]
[null,"292.89   -  Amphetamine-Induced Sexual Dysfunction",null,null,null,null,null,null,null,null,null,null,null,null,null,null,null,null,null,null,null,null,null,null,null,null,null,78,"292.89  -  Cannabis Intoxication","292.89"]
[null,"292.89   -  Amphetamine-Induced Sleep Disorder (before 10.01.2005)",null,null,null,null,null,null,null,null,null,null,null,null,null,null,null,null,null,null,null,null,null,null,null,null,null,79,"292.89  -  Cocaine-Induced Anxiety Disorder","292.89"]
[null,"292.89   -  Amphetamine Intoxication",null,null,null,null,null,null,null,null,null,null,null,null,null,null,null,null,null,null,null,null,null,null,null,null,null,80,"292.89   -  Cocaine-Induced Sexual Dysfunction  ","292.89 "]
[null,"292.89   -  Caffeine-Induced Anxiety Disorder",null,null,null,null,null,null,null,null,null,null,null,null,null,null,null,null,null,null,null,null,null,null,null,null,null,81,"292.89   -  Cocaine-Induced Sleep Disorder (before 10.01.2005)","292.89 "]
[null,"292.89   -  Caffeine-Induced Sleep Disorder (before 10.01.2005)",null,null,null,null,null,null,null,null,null,null,null,null,null,null,null,null,null,null,null,null,null,null,null,null,null,82,"292.89   -  Cocaine Intoxication","292.89 "]
[null,"292.89   -  Cannabis-Induced Anxiety Disorder",null,null,null,null,null,null,null,null,null,null,null,null,null,null,null,null,null,null,null,null,null,null,null,null,null,83,"292.89   -  Hallucinogen-Induced Anxiety Disorder","292.89 "]
[null,"292.89  -  Cannabis Intoxication",null,null,null,null,null,null,null,null,null,null,null,null,null,null,null,null,null,null,null,null,null,null,null,null,null,84,"292.89   -  Hallucinogen Intoxication","292.89 "]
[null,"292.89  -  Cocaine-Induced Anxiety Disorder",null,null,null,null,null,null,null,null,null,null,null,null,null,null,null,null,null,null,null,null,null,null,null,null,null,85,"292.89   -  Hallucinogen Persisting Perception Disorder","292.89 "]
[null,"292.89   -  Cocaine-Induced Sexual Dysfunction  ",null,null,null,null,null,null,null,null,null,null,null,null,null,null,null,null,null,null,null,null,null,null,null,null,null,86,"292.89   -  Inhalant-Induced Anxiety Disorder","292.89 "]
[null,"292.89   -  Cocaine-Induced Sleep Disorder (before 10.01.2005)",null,null,null,null,null,null,null,null,null,null,null,null,null,null,null,null,null,null,null,null,null,null,null,null,null,87,"292.89  -  Inhalant Intoxication","292.89"]
[null,"292.89   -  Cocaine Intoxication",null,null,null,null,null,null,null,null,null,null,null,null,null,null,null,null,null,null,null,null,null,null,null,null,null,88,"292.89   -  Opioid-Induced Sexual Dysfunctiona> ","292.89 "]
[null,"292.89   -  Hallucinogen-Induced Anxiety Disorder",null,null,null,null,null,null,null,null,null,null,null,null,null,null,null,null,null,null,null,null,null,null,null,null,null,89,"292.89   -  Opioid-Induced Sleep Disorder (before 10.01.2005)","292.89 "]
[null,"292.89   -  Hallucinogen Intoxication",null,null,null,null,null,null,null,null,null,null,null,null,null,null,null,null,null,null,null,null,null,null,null,null,null,90,"292.89   -  Opioid Intoxication","292.89 "]
[null,"292.89   -  Hallucinogen Persisting Perception Disorder",null,null,null,null,null,null,null,null,null,null,null,null,null,null,null,null,null,null,null,null,null,null,null,null,null,91,"292.89   -  Other (or Unknown) Substance-Induced Anxiety Disorder","292.89 "]
[null,"292.89   -  Inhalant-Induced Anxiety Disorder",null,null,null,null,null,null,null,null,null,null,null,null,null,null,null,null,null,null,null,null,null,null,null,null,null,92,"292.89   -  Other (or Unknown) Substance-Induced Sexual Dysfunction","292.89 "]
[null,"292.89  -  Inhalant Intoxication",null,null,null,null,null,null,null,null,null,null,null,null,null,null,null,null,null,null,null,null,null,null,null,null,null,93,"292.89   -  Other (or Unknown) Substance-Induced Sleep Disorder (before 10.01.2005)","292.89 "]
[null,"292.89   -  Opioid-Induced Sexual Dysfunctiona> ",null,null,null,null,null,null,null,null,null,null,null,null,null,null,null,null,null,null,null,null,null,null,null,null,null,94,"292.89  -  Other (or Unknown) Substance Intoxication","292.89"]
[null,"292.89   -  Opioid-Induced Sleep Disorder (before 10.01.2005)",null,null,null,null,null,null,null,null,null,null,null,null,null,null,null,null,null,null,null,null,null,null,null,null,null,95,"292.89   -  Phencyclidine-Induced Anxiety Disorder","292.89 "]
[null,"292.89   -  Opioid Intoxication",null,null,null,null,null,null,null,null,null,null,null,null,null,null,null,null,null,null,null,null,null,null,null,null,null,96,"292.89  -  Phencyclidine Intoxication","292.89"]
[null,"292.89   -  Other (or Unknown) Substance-Induced Anxiety Disorder",null,null,null,null,null,null,null,null,null,null,null,null,null,null,null,null,null,null,null,null,null,null,null,null,null,97,"292.89   -  Sedative, Hypnotic, or Anxiolytic-Induced Anxiety Disorder","292.89 "]
[null,"292.89   -  Other (or Unknown) Substance-Induced Sexual Dysfunction",null,null,null,null,null,null,null,null,null,null,null,null,null,null,null,null,null,null,null,null,null,null,null,null,null,98,"292.89   -  Sedative, Hypnotic, or Anxiolytic-Induced Sexual Dysfunction","292.89 "]
[null,"292.89   -  Other (or Unknown) Substance-Induced Sleep Disorder (before 10.01.2005)",null,null,null,null,null,null,null,null,null,null,null,null,null,null,null,null,null,null,null,null,null,null,null,null,null,99,"292.89   -  Sedative, Hypnotic, or Anxiolytic-Induced Sleep Disorder (before 10.01.2005)","292.89 "]
[null,"292.89  -  Other (or Unknown) Substance Intoxication",null,null,null,null,null,null,null,null,null,null,null,null,null,null,null,null,null,null,null,null,null,null,null,null,null,100,"292.89   -  Sedative, Hypnotic, or Anxiolytic Intoxication","292.89 "]
[null,"292.89   -  Phencyclidine-Induced Anxiety Disorder",null,null,null,null,null,null,null,null,null,null,null,null,null,null,null,null,null,null,null,null,null,null,null,null,null,101,"292.9   -  Amphetamine-Related Disorder NOS","292.9 "]
[null,"292.89  -  Phencyclidine Intoxication",null,null,null,null,null,null,null,null,null,null,null,null,null,null,null,null,null,null,null,null,null,null,null,null,null,102,"292.9   -  Caffeine-Related Disorder NOS","292.9 "]
[null,"292.89   -  Sedative, Hypnotic, or Anxiolytic-Induced Anxiety Disorder",null,null,null,null,null,null,null,null,null,null,null,null,null,null,null,null,null,null,null,null,null,null,null,null,null,103,"292.9   -  Cannabis-Related Disorder NOS","292.9 "]
[null,"292.89   -  Sedative, Hypnotic, or Anxiolytic-Induced Sexual Dysfunction",null,null,null,null,null,null,null,null,null,null,null,null,null,null,null,null,null,null,null,null,null,null,null,null,null,104,"292.9   -  Cocaine-Related Disorder NOS","292.9 "]
[null,"292.89   -  Sedative, Hypnotic, or Anxiolytic-Induced Sleep Disorder (before 10.01.2005)",null,null,null,null,null,null,null,null,null,null,null,null,null,null,null,null,null,null,null,null,null,null,null,null,null,105,"292.9   -  Hallucinogen-Related Disorder NOS","292.9 "]
[null,"292.89   -  Sedative, Hypnotic, or Anxiolytic Intoxication",null,null,null,null,null,null,null,null,null,null,null,null,null,null,null,null,null,null,null,null,null,null,null,null,null,106,"292.9   -  Inhalant-Related Disorder NOS","292.9 "]
[null,"292.9   -  Amphetamine-Related Disorder NOS",null,null,null,null,null,null,null,null,null,null,null,null,null,null,null,null,null,null,null,null,null,null,null,null,null,107,"292.9   -  Nicotine-Related Disorder NOS","292.9 "]
[null,"292.9   -  Caffeine-Related Disorder NOS",null,null,null,null,null,null,null,null,null,null,null,null,null,null,null,null,null,null,null,null,null,null,null,null,null,108,"292.9   -  Opioid-Related Disorder NOS","292.9 "]
[null,"292.9   -  Cannabis-Related Disorder NOS",null,null,null,null,null,null,null,null,null,null,null,null,null,null,null,null,null,null,null,null,null,null,null,null,null,109,"292.9   -  Other (or Unknown) Substance-Related Disorder NOS","292.9 "]
[null,"292.9   -  Cocaine-Related Disorder NOS",null,null,null,null,null,null,null,null,null,null,null,null,null,null,null,null,null,null,null,null,null,null,null,null,null,110,"292.9   -  Phencyclidine-Related Disorder NOS","292.9 "]
[null,"292.9   -  Hallucinogen-Related Disorder NOS",null,null,null,null,null,null,null,null,null,null,null,null,null,null,null,null,null,null,null,null,null,null,null,null,null,111,"292.9   -  Sedative, Hypnotic, or Anxiolytic-Related DisorderNOS","292.9 "]
[null,"292.9   -  Inhalant-Related Disorder NOS",null,null,null,null,null,null,null,null,null,null,null,null,null,null,null,null,null,null,null,null,null,null,null,null,null,112,"293.0   -  Delirium Due to...[Indicate the General Medical Condition]","293.0 "]
[null,"292.9   -  Nicotine-Related Disorder NOS",null,null,null,null,null,null,null,null,null,null,null,null,null,null,null,null,null,null,null,null,null,null,null,null,null,113,"293.81   -  Psychotic Disorder Due to...[Indicate the General Medical Condition], With Delusions","293.81 "]
[null,"292.9   -  Opioid-Related Disorder NOS",null,null,null,null,null,null,null,null,null,null,null,null,null,null,null,null,null,null,null,null,null,null,null,null,null,114,"293.82   -  Psychotic Disorder Due to...[Indicate the General Medical Condition] , With Hallucinations","293.82 "]
[null,"292.9   -  Other (or Unknown) Substance-Related Disorder NOS",null,null,null,null,null,null,null,null,null,null,null,null,null,null,null,null,null,null,null,null,null,null,null,null,null,115,"293.83   -  Mood Disorder Due to...[Indicate the General Medical Condition]","293.83 "]
[null,"292.9   -  Phencyclidine-Related Disorder NOS",null,null,null,null,null,null,null,null,null,null,null,null,null,null,null,null,null,null,null,null,null,null,null,null,null,116,"293.84   -  Anxiety Disorder Due to... (new code as of 10/01/96) [Indicate the General Medical Condition] ","293.84 "]
[null,"292.9   -  Sedative, Hypnotic, or Anxiolytic-Related DisorderNOS",null,null,null,null,null,null,null,null,null,null,null,null,null,null,null,null,null,null,null,null,null,null,null,null,null,117,"293.89   -  Catatonic Disorder Due to...[Indicate the General Medical Condition]","293.89 "]
[null,"293.0   -  Delirium Due to...[Indicate the General Medical Condition]",null,null,null,null,null,null,null,null,null,null,null,null,null,null,null,null,null,null,null,null,null,null,null,null,null,118,"293.9   -  Mental Disorder NOS Due to...[Indicate the General Medical Condition] ","293.9 "]
[null,"293.81   -  Psychotic Disorder Due to...[Indicate the General Medical Condition], With Delusions",null,null,null,null,null,null,null,null,null,null,null,null,null,null,null,null,null,null,null,null,null,null,null,null,null,119,"294.0   -  Amnestic Disorder Due to...[Indicate the General Medical Condition], Without Behavioral Disturbance","294.0 "]
[null,"293.82   -  Psychotic Disorder Due to...[Indicate the General Medical Condition] , With Hallucinations",null,null,null,null,null,null,null,null,null,null,null,null,null,null,null,null,null,null,null,null,null,null,null,null,null,120,"294.10  -  Dementia Due to...[Indicate the General Medical Condition], Without Behavioral Disturbance","294.10"]
[null,"293.83   -  Mood Disorder Due to...[Indicate the General Medical Condition]",null,null,null,null,null,null,null,null,null,null,null,null,null,null,null,null,null,null,null,null,null,null,null,null,null,121,"294.10  -  Dementia of the Alzheimer's Type, With Early Onset, Without Behavioral Disturbance","294.10"]
[null,"293.84   -  Anxiety Disorder Due to... (new code as of 10/01/96) [Indicate the General Medical Condition] ",null,null,null,null,null,null,null,null,null,null,null,null,null,null,null,null,null,null,null,null,null,null,null,null,null,122,"294.10  -  Dementia of the Alzheimer's Type, With Late Onset, Without Behavioral Distrubance","294.10"]
[null,"293.89   -  Catatonic Disorder Due to...[Indicate the General Medical Condition]",null,null,null,null,null,null,null,null,null,null,null,null,null,null,null,null,null,null,null,null,null,null,null,null,null,123,"294.11  -  Dementia Due to...[Indicate the General Medical Condition], With Behavioral Disturbance","294.11"]
[null,"293.9   -  Mental Disorder NOS Due to...[Indicate the General Medical Condition] ",null,null,null,null,null,null,null,null,null,null,null,null,null,null,null,null,null,null,null,null,null,null,null,null,null,124,"294.11  -  Dementia of the Alzheimer's Type, With Early Onset, With Behavioral Disturbance","294.11"]
[null,"294.0   -  Amnestic Disorder Due to...[Indicate the General Medical Condition], Without Behavioral Disturbance",null,null,null,null,null,null,null,null,null,null,null,null,null,null,null,null,null,null,null,null,null,null,null,null,null,125,"294.11  -  Dementia of the Alzheimer's Type, With Late Onset, With Behavioral Disturbance","294.11"]
[null,"294.10  -  Dementia Due to...[Indicate the General Medical Condition], Without Behavioral Disturbance",null,null,null,null,null,null,null,null,null,null,null,null,null,null,null,null,null,null,null,null,null,null,null,null,null,126,"294.1x  -  Dementia Due to Creutzfeldt-Jakob Disease","294.1x"]
[null,"294.10  -  Dementia of the Alzheimer's Type, With Early Onset, Without Behavioral Disturbance",null,null,null,null,null,null,null,null,null,null,null,null,null,null,null,null,null,null,null,null,null,null,null,null,null,127,"294.1x  -  Dementia Due to Head Trauma","294.1x"]
[null,"294.10  -  Dementia of the Alzheimer's Type, With Late Onset, Without Behavioral Distrubance",null,null,null,null,null,null,null,null,null,null,null,null,null,null,null,null,null,null,null,null,null,null,null,null,null,128,"294.1x  -  Dementia Due to HIV Disease","294.1x"]
[null,"294.11  -  Dementia Due to...[Indicate the General Medical Condition], With Behavioral Disturbance",null,null,null,null,null,null,null,null,null,null,null,null,null,null,null,null,null,null,null,null,null,null,null,null,null,129,"294.1x  -  Dementia Due to Huntington's Disease","294.1x"]
[null,"294.11  -  Dementia of the Alzheimer's Type, With Early Onset, With Behavioral Disturbance",null,null,null,null,null,null,null,null,null,null,null,null,null,null,null,null,null,null,null,null,null,null,null,null,null,130,"294.1x  -  Dementia Due to Parkinson's Disease","294.1x"]
[null,"294.11  -  Dementia of the Alzheimer's Type, With Late Onset, With Behavioral Disturbance",null,null,null,null,null,null,null,null,null,null,null,null,null,null,null,null,null,null,null,null,null,null,null,null,null,131,"294.1x  -  Dementia Due to Pick's Disease","294.1x"]
[null,"294.1x  -  Dementia Due to Creutzfeldt-Jakob Disease",null,null,null,null,null,null,null,null,null,null,null,null,null,null,null,null,null,null,null,null,null,null,null,null,null,132,"294.1x  -  Dementia Due to...[Indicate the General Medical Condition not listed above] (also code the general medical condition on Axis III)","294.1x"]
[null,"294.1x  -  Dementia Due to Head Trauma",null,null,null,null,null,null,null,null,null,null,null,null,null,null,null,null,null,null,null,null,null,null,null,null,null,133,"294.8  -  Amnestic Disorder NOS","294.8"]
[null,"294.1x  -  Dementia Due to HIV Disease",null,null,null,null,null,null,null,null,null,null,null,null,null,null,null,null,null,null,null,null,null,null,null,null,null,134,"294.8   -  Dementia NOS","294.8 "]
[null,"294.1x  -  Dementia Due to Huntington's Disease",null,null,null,null,null,null,null,null,null,null,null,null,null,null,null,null,null,null,null,null,null,null,null,null,null,135,"294.9   -  Cognitive Disorder NOS","294.9 "]
[null,"294.1x  -  Dementia Due to Parkinson's Disease",null,null,null,null,null,null,null,null,null,null,null,null,null,null,null,null,null,null,null,null,null,null,null,null,null,136,"294.9   -  Cognitive Disorder (new code as of 10/01/96)","294.9 "]
[null,"294.1x  -  Dementia Due to Pick's Disease",null,null,null,null,null,null,null,null,null,null,null,null,null,null,null,null,null,null,null,null,null,null,null,null,null,137,"295.10   -  Schizophrenia, Disorganized Type","295.10 "]
[null,"294.1x  -  Dementia Due to...[Indicate the General Medical Condition not listed above] (also code the general medical condition on Axis III)",null,null,null,null,null,null,null,null,null,null,null,null,null,null,null,null,null,null,null,null,null,null,null,null,null,138,"295.20   -  Schizophrenia, Catatonic Type","295.20 "]
[null,"294.8  -  Amnestic Disorder NOS",null,null,null,null,null,null,null,null,null,null,null,null,null,null,null,null,null,null,null,null,null,null,null,null,null,139,"295.30   -  Schizophrenia, Paranoid Type","295.30 "]
[null,"294.8   -  Dementia NOS",null,null,null,null,null,null,null,null,null,null,null,null,null,null,null,null,null,null,null,null,null,null,null,null,null,140,"295.40   -  Schizophreniform Disorder","295.40 "]
[null,"294.9   -  Cognitive Disorder NOS",null,null,null,null,null,null,null,null,null,null,null,null,null,null,null,null,null,null,null,null,null,null,null,null,null,141,"295.60   -  Schizophrenia, Residual Type","295.60 "]
[null,"294.9   -  Cognitive Disorder (new code as of 10/01/96)",null,null,null,null,null,null,null,null,null,null,null,null,null,null,null,null,null,null,null,null,null,null,null,null,null,142,"295.70   -  Schizoaffective Disorder","295.70 "]
[null,"295.10   -  Schizophrenia, Disorganized Type",null,null,null,null,null,null,null,null,null,null,null,null,null,null,null,null,null,null,null,null,null,null,null,null,null,143,"295.90   -  Schizophrenia, Undifferentiated Type","295.90 "]
[null,"295.20   -  Schizophrenia, Catatonic Type",null,null,null,null,null,null,null,null,null,null,null,null,null,null,null,null,null,null,null,null,null,null,null,null,null,144,"296.00   -  Bipolar I Disorder, Single Manic Episode, Unspecified ","296.00 "]
[null,"295.30   -  Schizophrenia, Paranoid Type",null,null,null,null,null,null,null,null,null,null,null,null,null,null,null,null,null,null,null,null,null,null,null,null,null,145,"296.01   -  Bipolar I Disorder, Single Manic Episode, Mild ","296.01 "]
[null,"295.40   -  Schizophreniform Disorder",null,null,null,null,null,null,null,null,null,null,null,null,null,null,null,null,null,null,null,null,null,null,null,null,null,146,"296.02   -  Bipolar I Disorder, Single Manic Episode, Moderate ","296.02 "]
[null,"295.60   -  Schizophrenia, Residual Type",null,null,null,null,null,null,null,null,null,null,null,null,null,null,null,null,null,null,null,null,null,null,null,null,null,147,"296.03   -  Bipolar I Disorder, Single Manic Episode, Severe Without Psychotic Features ","296.03 "]
[null,"295.70   -  Schizoaffective Disorder",null,null,null,null,null,null,null,null,null,null,null,null,null,null,null,null,null,null,null,null,null,null,null,null,null,148,"296.04   -  Bipolar I Disorder, Single Manic Episode, Severe With Psychotic Features ","296.04 "]
[null,"295.90   -  Schizophrenia, Undifferentiated Type",null,null,null,null,null,null,null,null,null,null,null,null,null,null,null,null,null,null,null,null,null,null,null,null,null,149,"296.05   -  Bipolar I Disorder, Single Manic Episode, In Partial Remission ","296.05 "]
[null,"296.00   -  Bipolar I Disorder, Single Manic Episode, Unspecified ",null,null,null,null,null,null,null,null,null,null,null,null,null,null,null,null,null,null,null,null,null,null,null,null,null,150,"296.06   -  Bipolar I Disorder, Single Manic Episode, In Full Remission ","296.06 "]
[null,"296.01   -  Bipolar I Disorder, Single Manic Episode, Mild ",null,null,null,null,null,null,null,null,null,null,null,null,null,null,null,null,null,null,null,null,null,null,null,null,null,151,"296.20   -  Major Depressive Disorder, Single Episode, Unspecified ","296.20 "]
[null,"296.02   -  Bipolar I Disorder, Single Manic Episode, Moderate ",null,null,null,null,null,null,null,null,null,null,null,null,null,null,null,null,null,null,null,null,null,null,null,null,null,152,"296.21   -  Major Depressive Disorder, Single Episode, Mild ","296.21 "]
[null,"296.03   -  Bipolar I Disorder, Single Manic Episode, Severe Without Psychotic Features ",null,null,null,null,null,null,null,null,null,null,null,null,null,null,null,null,null,null,null,null,null,null,null,null,null,153,"296.22   -  Major Depressive Disorder, Single Episode, Moderate ","296.22 "]
[null,"296.04   -  Bipolar I Disorder, Single Manic Episode, Severe With Psychotic Features ",null,null,null,null,null,null,null,null,null,null,null,null,null,null,null,null,null,null,null,null,null,null,null,null,null,154,"296.23   -  Major Depressive Disorder, Single Episode, Severe Without Psychotic Features ","296.23 "]
[null,"296.05   -  Bipolar I Disorder, Single Manic Episode, In Partial Remission ",null,null,null,null,null,null,null,null,null,null,null,null,null,null,null,null,null,null,null,null,null,null,null,null,null,155,"296.24   -  Major Depressive Disorder, Single Episode, Severe With Psychotic Features ","296.24 "]
[null,"296.06   -  Bipolar I Disorder, Single Manic Episode, In Full Remission ",null,null,null,null,null,null,null,null,null,null,null,null,null,null,null,null,null,null,null,null,null,null,null,null,null,156,"296.25   -  Major Depressive Disorder, Single Episode, In Partial Remission ","296.25 "]
[null,"296.20   -  Major Depressive Disorder, Single Episode, Unspecified ",null,null,null,null,null,null,null,null,null,null,null,null,null,null,null,null,null,null,null,null,null,null,null,null,null,157,"296.26   -  Major Depressive Disorder, Single Episode, In Full Remission ","296.26 "]
[null,"296.21   -  Major Depressive Disorder, Single Episode, Mild ",null,null,null,null,null,null,null,null,null,null,null,null,null,null,null,null,null,null,null,null,null,null,null,null,null,158,"296.30   -  Major Depressive Disorder, Recurrent, Unspecified ","296.30 "]
[null,"296.22   -  Major Depressive Disorder, Single Episode, Moderate ",null,null,null,null,null,null,null,null,null,null,null,null,null,null,null,null,null,null,null,null,null,null,null,null,null,159,"296.31   -  Major Depressive Disorder, Recurrent, Mild ","296.31 "]
[null,"296.23   -  Major Depressive Disorder, Single Episode, Severe Without Psychotic Features ",null,null,null,null,null,null,null,null,null,null,null,null,null,null,null,null,null,null,null,null,null,null,null,null,null,160,"296.32   -  Major Depressive Disorder, Recurrent, Moderate ","296.32 "]
[null,"296.24   -  Major Depressive Disorder, Single Episode, Severe With Psychotic Features ",null,null,null,null,null,null,null,null,null,null,null,null,null,null,null,null,null,null,null,null,null,null,null,null,null,161,"296.33   -  Major Depressive Disorder, Recurrent, Severe Without Psychotic Features ","296.33 "]
[null,"296.25   -  Major Depressive Disorder, Single Episode, In Partial Remission ",null,null,null,null,null,null,null,null,null,null,null,null,null,null,null,null,null,null,null,null,null,null,null,null,null,162,"296.34   -  Major Depressive Disorder, Recurrent, Severe With Psychotic Features ","296.34 "]
[null,"296.26   -  Major Depressive Disorder, Single Episode, In Full Remission ",null,null,null,null,null,null,null,null,null,null,null,null,null,null,null,null,null,null,null,null,null,null,null,null,null,163,"296.35   -  Major Depressive Disorder, Recurrent, In Partial Remission ","296.35 "]
[null,"296.30   -  Major Depressive Disorder, Recurrent, Unspecified ",null,null,null,null,null,null,null,null,null,null,null,null,null,null,null,null,null,null,null,null,null,null,null,null,null,164,"296.36   -  Major Depressive Disorder, Recurrent, In Full Remission ","296.36 "]
[null,"296.31   -  Major Depressive Disorder, Recurrent, Mild ",null,null,null,null,null,null,null,null,null,null,null,null,null,null,null,null,null,null,null,null,null,null,null,null,null,165,"296.40   -  Bipolar I Disorder, Most Recent Episode Hypomanic  ","296.40 "]
[null,"296.32   -  Major Depressive Disorder, Recurrent, Moderate ",null,null,null,null,null,null,null,null,null,null,null,null,null,null,null,null,null,null,null,null,null,null,null,null,null,166,"296.40   -  Bipolar I Disorder, Most Recent Episode Manic, Unspecified","296.40 "]
[null,"296.33   -  Major Depressive Disorder, Recurrent, Severe Without Psychotic Features ",null,null,null,null,null,null,null,null,null,null,null,null,null,null,null,null,null,null,null,null,null,null,null,null,null,167,"296.41   -  Bipolar I Disorder, Most Recent Episode Manic, Mild","296.41 "]
[null,"296.34   -  Major Depressive Disorder, Recurrent, Severe With Psychotic Features ",null,null,null,null,null,null,null,null,null,null,null,null,null,null,null,null,null,null,null,null,null,null,null,null,null,168,"296.42   -  Bipolar I Disorder, Most Recent Episode Manic, Moderate ","296.42 "]
[null,"296.35   -  Major Depressive Disorder, Recurrent, In Partial Remission ",null,null,null,null,null,null,null,null,null,null,null,null,null,null,null,null,null,null,null,null,null,null,null,null,null,169,"296.43   -  Bipolar I Disorder, Most Recent Episode Manic, Severe Without Psychotic Features ","296.43 "]
[null,"296.36   -  Major Depressive Disorder, Recurrent, In Full Remission ",null,null,null,null,null,null,null,null,null,null,null,null,null,null,null,null,null,null,null,null,null,null,null,null,null,170,"296.44   -  Bipolar I Disorder, Most Recent Episode Manic, Severe With Psychotic Features ","296.44 "]
[null,"296.40   -  Bipolar I Disorder, Most Recent Episode Hypomanic  ",null,null,null,null,null,null,null,null,null,null,null,null,null,null,null,null,null,null,null,null,null,null,null,null,null,171,"296.45   -  Bipolar I Disorder, Most Recent Episode Manic, In Partial Remission ","296.45 "]
[null,"296.40   -  Bipolar I Disorder, Most Recent Episode Manic, Unspecified",null,null,null,null,null,null,null,null,null,null,null,null,null,null,null,null,null,null,null,null,null,null,null,null,null,172,"296.46   -  Bipolar I Disorder, Most Recent Episode Manic, In Full Remission ","296.46 "]
[null,"296.41   -  Bipolar I Disorder, Most Recent Episode Manic, Mild",null,null,null,null,null,null,null,null,null,null,null,null,null,null,null,null,null,null,null,null,null,null,null,null,null,173,"296.50   -  Bipolar I Disorder, Most Recent Episode Depressed, Unspecified","296.50 "]
[null,"296.42   -  Bipolar I Disorder, Most Recent Episode Manic, Moderate ",null,null,null,null,null,null,null,null,null,null,null,null,null,null,null,null,null,null,null,null,null,null,null,null,null,174,"296.51   -  Bipolar I Disorder, Most Recent Episode Depressed, Mild ","296.51 "]
[null,"296.43   -  Bipolar I Disorder, Most Recent Episode Manic, Severe Without Psychotic Features ",null,null,null,null,null,null,null,null,null,null,null,null,null,null,null,null,null,null,null,null,null,null,null,null,null,175,"296.52   -  Bipolar I Disorder, Most Recent Episode Depressed, Moderate ","296.52 "]
[null,"296.44   -  Bipolar I Disorder, Most Recent Episode Manic, Severe With Psychotic Features ",null,null,null,null,null,null,null,null,null,null,null,null,null,null,null,null,null,null,null,null,null,null,null,null,null,176,"296.53   -  Bipolar I Disorder, Most Recent Episode Depressed, Severe Without Psychotic Features ","296.53 "]
[null,"296.45   -  Bipolar I Disorder, Most Recent Episode Manic, In Partial Remission ",null,null,null,null,null,null,null,null,null,null,null,null,null,null,null,null,null,null,null,null,null,null,null,null,null,177,"296.54   -  Bipolar I Disorder, Most Recent Episode Depressed, Severe With Psychotic Features ","296.54 "]
[null,"296.46   -  Bipolar I Disorder, Most Recent Episode Manic, In Full Remission ",null,null,null,null,null,null,null,null,null,null,null,null,null,null,null,null,null,null,null,null,null,null,null,null,null,178,"296.55   -  Bipolar I Disorder, Most Recent Episode Depressed, In Partial Remission ","296.55 "]
[null,"296.50   -  Bipolar I Disorder, Most Recent Episode Depressed, Unspecified",null,null,null,null,null,null,null,null,null,null,null,null,null,null,null,null,null,null,null,null,null,null,null,null,null,179,"296.56   -  Bipolar I Disorder, Most Recent Episode Depressed, In Full Remission ","296.56 "]
[null,"296.51   -  Bipolar I Disorder, Most Recent Episode Depressed, Mild ",null,null,null,null,null,null,null,null,null,null,null,null,null,null,null,null,null,null,null,null,null,null,null,null,null,180,"296.60  -  Bipolar I Disorder, Most Recent Episode Mixed, Unspecified ","296.60"]
[null,"296.52   -  Bipolar I Disorder, Most Recent Episode Depressed, Moderate ",null,null,null,null,null,null,null,null,null,null,null,null,null,null,null,null,null,null,null,null,null,null,null,null,null,181,"296.61   -  Bipolar I Disorder, Most Recent Episode Mixed, Mild ","296.61 "]
[null,"296.53   -  Bipolar I Disorder, Most Recent Episode Depressed, Severe Without Psychotic Features ",null,null,null,null,null,null,null,null,null,null,null,null,null,null,null,null,null,null,null,null,null,null,null,null,null,182,"296.62   -  Bipolar I Disorder, Most Recent Episode Mixed, Moderate ","296.62 "]
[null,"296.54   -  Bipolar I Disorder, Most Recent Episode Depressed, Severe With Psychotic Features ",null,null,null,null,null,null,null,null,null,null,null,null,null,null,null,null,null,null,null,null,null,null,null,null,null,183,"296.63   -  Bipolar I Disorder, Most Recent Episode Mixed, Severe Without Psychotic Features ","296.63 "]
[null,"296.55   -  Bipolar I Disorder, Most Recent Episode Depressed, In Partial Remission ",null,null,null,null,null,null,null,null,null,null,null,null,null,null,null,null,null,null,null,null,null,null,null,null,null,184,"296.64   -  Bipolar I Disorder, Most Recent Episode Mixed, Severe With Psychotic Features ","296.64 "]
[null,"296.56   -  Bipolar I Disorder, Most Recent Episode Depressed, In Full Remission ",null,null,null,null,null,null,null,null,null,null,null,null,null,null,null,null,null,null,null,null,null,null,null,null,null,185,"296.65   -  Bipolar I Disorder, Most Recent Episode Mixed, In Partial Remission ","296.65 "]
[null,"296.60  -  Bipolar I Disorder, Most Recent Episode Mixed, Unspecified ",null,null,null,null,null,null,null,null,null,null,null,null,null,null,null,null,null,null,null,null,null,null,null,null,null,186,"296.66   -  Bipolar I Disorder, Most Recent Episode Mixed, In Full Remission ","296.66 "]
[null,"296.61   -  Bipolar I Disorder, Most Recent Episode Mixed, Mild ",null,null,null,null,null,null,null,null,null,null,null,null,null,null,null,null,null,null,null,null,null,null,null,null,null,187,"296.7   -  Bipolar I Disorder, Most Recent Episode Unspecified","296.7 "]
[null,"296.62   -  Bipolar I Disorder, Most Recent Episode Mixed, Moderate ",null,null,null,null,null,null,null,null,null,null,null,null,null,null,null,null,null,null,null,null,null,null,null,null,null,188,"296.80   -  Bipolar Disorder NOS","296.80 "]
[null,"296.63   -  Bipolar I Disorder, Most Recent Episode Mixed, Severe Without Psychotic Features ",null,null,null,null,null,null,null,null,null,null,null,null,null,null,null,null,null,null,null,null,null,null,null,null,null,189,"296.89   -  Bipolar II Disorder","296.89 "]
[null,"296.64   -  Bipolar I Disorder, Most Recent Episode Mixed, Severe With Psychotic Features ",null,null,null,null,null,null,null,null,null,null,null,null,null,null,null,null,null,null,null,null,null,null,null,null,null,190,"296.90   -  Mood Disorder NOS","296.90 "]
[null,"296.65   -  Bipolar I Disorder, Most Recent Episode Mixed, In Partial Remission ",null,null,null,null,null,null,null,null,null,null,null,null,null,null,null,null,null,null,null,null,null,null,null,null,null,191,"297.1   -  Delusional Disorder","297.1 "]
[null,"296.66   -  Bipolar I Disorder, Most Recent Episode Mixed, In Full Remission ",null,null,null,null,null,null,null,null,null,null,null,null,null,null,null,null,null,null,null,null,null,null,null,null,null,192,"297.3   -  Shared Psychotic Disorder","297.3 "]
[null,"296.7   -  Bipolar I Disorder, Most Recent Episode Unspecified",null,null,null,null,null,null,null,null,null,null,null,null,null,null,null,null,null,null,null,null,null,null,null,null,null,193,"298.8   -  Brief Psychotic Disorder","298.8 "]
[null,"296.80   -  Bipolar Disorder NOS",null,null,null,null,null,null,null,null,null,null,null,null,null,null,null,null,null,null,null,null,null,null,null,null,null,194,"298.9   -  Psychotic Disorder NOS","298.9 "]
[null,"296.89   -  Bipolar II Disorder",null,null,null,null,null,null,null,null,null,null,null,null,null,null,null,null,null,null,null,null,null,null,null,null,null,195,"299.00   -  Autistic Disorder","299.00 "]
[null,"296.90   -  Mood Disorder NOS",null,null,null,null,null,null,null,null,null,null,null,null,null,null,null,null,null,null,null,null,null,null,null,null,null,196,"299.10   -  Childhood Disintegrative Disorder","299.10 "]
[null,"297.1   -  Delusional Disorder",null,null,null,null,null,null,null,null,null,null,null,null,null,null,null,null,null,null,null,null,null,null,null,null,null,197,"299.80   -  Asperger's Disorder ","299.80 "]
[null,"297.3   -  Shared Psychotic Disorder",null,null,null,null,null,null,null,null,null,null,null,null,null,null,null,null,null,null,null,null,null,null,null,null,null,198,"299.80   -  Pervasive Developmental Disorder NOS","299.80 "]
[null,"298.8   -  Brief Psychotic Disorder",null,null,null,null,null,null,null,null,null,null,null,null,null,null,null,null,null,null,null,null,null,null,null,null,null,199,"299.80   -  Rett's Disorder","299.80 "]
[null,"298.9   -  Psychotic Disorder NOS",null,null,null,null,null,null,null,null,null,null,null,null,null,null,null,null,null,null,null,null,null,null,null,null,null,200,"300.00   -  Anxiety Disorder NOS","300.00 "]
[null,"299.00   -  Autistic Disorder",null,null,null,null,null,null,null,null,null,null,null,null,null,null,null,null,null,null,null,null,null,null,null,null,null,201,"300.01   -  Panic Disorder Without Agoraphobia","300.01 "]
[null,"299.10   -  Childhood Disintegrative Disorder",null,null,null,null,null,null,null,null,null,null,null,null,null,null,null,null,null,null,null,null,null,null,null,null,null,202,"300.02   -  Generalized Anxiety Disorder ","300.02 "]
[null,"299.80   -  Asperger's Disorder ",null,null,null,null,null,null,null,null,null,null,null,null,null,null,null,null,null,null,null,null,null,null,null,null,null,203,"300.11   -  Conversion Disorder","300.11 "]
[null,"299.80   -  Pervasive Developmental Disorder NOS",null,null,null,null,null,null,null,null,null,null,null,null,null,null,null,null,null,null,null,null,null,null,null,null,null,204,"300.12   -  Dissociative Amnesia","300.12 "]
[null,"299.80   -  Rett's Disorder",null,null,null,null,null,null,null,null,null,null,null,null,null,null,null,null,null,null,null,null,null,null,null,null,null,205,"300.13   -  Dissociative Fugue","300.13 "]
[null,"300.00   -  Anxiety Disorder NOS",null,null,null,null,null,null,null,null,null,null,null,null,null,null,null,null,null,null,null,null,null,null,null,null,null,206,"300.14   -  Dissociative Identity Disorder","300.14 "]
[null,"300.01   -  Panic Disorder Without Agoraphobia",null,null,null,null,null,null,null,null,null,null,null,null,null,null,null,null,null,null,null,null,null,null,null,null,null,207,"300.15   -  Dissociative Disorder NOS","300.15 "]
[null,"300.02   -  Generalized Anxiety Disorder ",null,null,null,null,null,null,null,null,null,null,null,null,null,null,null,null,null,null,null,null,null,null,null,null,null,208,"300.16   -  Factitious Disorder With Predominantly PsychologicalSigns and Symptoms","300.16 "]
[null,"300.11   -  Conversion Disorder",null,null,null,null,null,null,null,null,null,null,null,null,null,null,null,null,null,null,null,null,null,null,null,null,null,209,"300.19   -  Factitious Disorder NOS","300.19 "]
[null,"300.12   -  Dissociative Amnesia",null,null,null,null,null,null,null,null,null,null,null,null,null,null,null,null,null,null,null,null,null,null,null,null,null,210,"300.19   -  Factitious Disorder With Combined Psychological and Physical Signs and Symptoms","300.19 "]
[null,"300.13   -  Dissociative Fugue",null,null,null,null,null,null,null,null,null,null,null,null,null,null,null,null,null,null,null,null,null,null,null,null,null,211,"300.19   -  Factitious Disorder With Predominantly Physical Signsand Symptoms","300.19 "]
[null,"300.14   -  Dissociative Identity Disorder",null,null,null,null,null,null,null,null,null,null,null,null,null,null,null,null,null,null,null,null,null,null,null,null,null,212,"300.21   -  Panic Disorder With Agoraphobia","300.21 "]
[null,"300.15   -  Dissociative Disorder NOS",null,null,null,null,null,null,null,null,null,null,null,null,null,null,null,null,null,null,null,null,null,null,null,null,null,213,"300.22   -  Agoraphobia Without History of Panic Disorder","300.22 "]
[null,"300.16   -  Factitious Disorder With Predominantly PsychologicalSigns and Symptoms",null,null,null,null,null,null,null,null,null,null,null,null,null,null,null,null,null,null,null,null,null,null,null,null,null,214,"300.23   -  Social Phobia","300.23 "]
[null,"300.19   -  Factitious Disorder NOS",null,null,null,null,null,null,null,null,null,null,null,null,null,null,null,null,null,null,null,null,null,null,null,null,null,215,"300.29   -  Specific Phobia","300.29 "]
[null,"300.19   -  Factitious Disorder With Combined Psychological and Physical Signs and Symptoms",null,null,null,null,null,null,null,null,null,null,null,null,null,null,null,null,null,null,null,null,null,null,null,null,null,216,"300.3   -  Obsessive-Compulsive Disorder","300.3 "]
[null,"300.19   -  Factitious Disorder With Predominantly Physical Signsand Symptoms",null,null,null,null,null,null,null,null,null,null,null,null,null,null,null,null,null,null,null,null,null,null,null,null,null,217,"300.4   -  Dysthymic Disorder","300.4 "]
[null,"300.21   -  Panic Disorder With Agoraphobia",null,null,null,null,null,null,null,null,null,null,null,null,null,null,null,null,null,null,null,null,null,null,null,null,null,218,"300.6   -  Depersonalization Disorder","300.6 "]
[null,"300.22   -  Agoraphobia Without History of Panic Disorder",null,null,null,null,null,null,null,null,null,null,null,null,null,null,null,null,null,null,null,null,null,null,null,null,null,219,"300.7   -  Body Dysmorphic Disorder","300.7 "]
[null,"300.23   -  Social Phobia",null,null,null,null,null,null,null,null,null,null,null,null,null,null,null,null,null,null,null,null,null,null,null,null,null,220,"300.7   -  Hypochondriasis","300.7 "]
[null,"300.29   -  Specific Phobia",null,null,null,null,null,null,null,null,null,null,null,null,null,null,null,null,null,null,null,null,null,null,null,null,null,221,"300.81   -  Somatization Disorder","300.81 "]
[null,"300.3   -  Obsessive-Compulsive Disorder",null,null,null,null,null,null,null,null,null,null,null,null,null,null,null,null,null,null,null,null,null,null,null,null,null,222,"300.82   -  Somatoform Disorder NOS (new code as of 10/01/96) ","300.82 "]
[null,"300.4   -  Dysthymic Disorder",null,null,null,null,null,null,null,null,null,null,null,null,null,null,null,null,null,null,null,null,null,null,null,null,null,223,"300.82   -  Undifferentiated Somatoform Disorder (new code as of 10/01/96) ","300.82 "]
[null,"300.6   -  Depersonalization Disorder",null,null,null,null,null,null,null,null,null,null,null,null,null,null,null,null,null,null,null,null,null,null,null,null,null,224,"300.9   -  Unspecified Mental Disorder (nonpsychotic) ","300.9 "]
[null,"300.7   -  Body Dysmorphic Disorder",null,null,null,null,null,null,null,null,null,null,null,null,null,null,null,null,null,null,null,null,null,null,null,null,null,225,"301.0   -  Paranoid Personality Disorder","301.0 "]
[null,"300.7   -  Hypochondriasis",null,null,null,null,null,null,null,null,null,null,null,null,null,null,null,null,null,null,null,null,null,null,null,null,null,226,"301.13   -  Cyclothymic Disorder","301.13 "]
[null,"300.81   -  Somatization Disorder",null,null,null,null,null,null,null,null,null,null,null,null,null,null,null,null,null,null,null,null,null,null,null,null,null,227,"301.20   -  Schizoid Personality Disorder","301.20 "]
[null,"300.82   -  Somatoform Disorder NOS (new code as of 10/01/96) ",null,null,null,null,null,null,null,null,null,null,null,null,null,null,null,null,null,null,null,null,null,null,null,null,null,228,"301.22   -  Schizotypal Personality Disorder","301.22 "]
[null,"300.82   -  Undifferentiated Somatoform Disorder (new code as of 10/01/96) ",null,null,null,null,null,null,null,null,null,null,null,null,null,null,null,null,null,null,null,null,null,null,null,null,null,229,"301.4   -  Obsessive-Compulsive Personality Disorder","301.4 "]
[null,"300.9   -  Unspecified Mental Disorder (nonpsychotic) ",null,null,null,null,null,null,null,null,null,null,null,null,null,null,null,null,null,null,null,null,null,null,null,null,null,230,"301.50   -  Histrionic Personality Disorder","301.50 "]
[null,"301.0   -  Paranoid Personality Disorder",null,null,null,null,null,null,null,null,null,null,null,null,null,null,null,null,null,null,null,null,null,null,null,null,null,231,"301.6   -  Dependent Personality Disorder","301.6 "]
[null,"301.13   -  Cyclothymic Disorder",null,null,null,null,null,null,null,null,null,null,null,null,null,null,null,null,null,null,null,null,null,null,null,null,null,232,"301.7   -  Antisocial Personality Disorder","301.7 "]
[null,"301.20   -  Schizoid Personality Disorder",null,null,null,null,null,null,null,null,null,null,null,null,null,null,null,null,null,null,null,null,null,null,null,null,null,233,"301.81   -  Narcissistic Personality Disorder","301.81 "]
[null,"301.22   -  Schizotypal Personality Disorder",null,null,null,null,null,null,null,null,null,null,null,null,null,null,null,null,null,null,null,null,null,null,null,null,null,234,"301.82   -  Avoidant Personality Disorder","301.82 "]
[null,"301.4   -  Obsessive-Compulsive Personality Disorder",null,null,null,null,null,null,null,null,null,null,null,null,null,null,null,null,null,null,null,null,null,null,null,null,null,235,"301.83   -  Borderline Personality Disorder","301.83 "]
[null,"301.50   -  Histrionic Personality Disorder",null,null,null,null,null,null,null,null,null,null,null,null,null,null,null,null,null,null,null,null,null,null,null,null,null,236,"301.9   -  Personality Disorder NOS","301.9 "]
[null,"301.6   -  Dependent Personality Disorder",null,null,null,null,null,null,null,null,null,null,null,null,null,null,null,null,null,null,null,null,null,null,null,null,null,237,"302.2   -  Pedophilia","302.2 "]
[null,"301.7   -  Antisocial Personality Disorder",null,null,null,null,null,null,null,null,null,null,null,null,null,null,null,null,null,null,null,null,null,null,null,null,null,238,"302.3   -  Transvestic Fetishism","302.3 "]
[null,"301.81   -  Narcissistic Personality Disorder",null,null,null,null,null,null,null,null,null,null,null,null,null,null,null,null,null,null,null,null,null,null,null,null,null,239,"302.4   -  Exhibitionism","302.4 "]
[null,"301.82   -  Avoidant Personality Disorder",null,null,null,null,null,null,null,null,null,null,null,null,null,null,null,null,null,null,null,null,null,null,null,null,null,240,"302.6   -  Gender Identity Disorder in Children ","302.6 "]
[null,"301.83   -  Borderline Personality Disorder",null,null,null,null,null,null,null,null,null,null,null,null,null,null,null,null,null,null,null,null,null,null,null,null,null,241,"302.6   -  Gender Identity Disorder NOS","302.6 "]
[null,"301.9   -  Personality Disorder NOS",null,null,null,null,null,null,null,null,null,null,null,null,null,null,null,null,null,null,null,null,null,null,null,null,null,242,"302.70   -  Sexual Dysfunction NOS","302.70 "]
[null,"302.2   -  Pedophilia",null,null,null,null,null,null,null,null,null,null,null,null,null,null,null,null,null,null,null,null,null,null,null,null,null,243,"302.71   -  Hypoactive Sexual Desire Disorder","302.71 "]
[null,"302.3   -  Transvestic Fetishism",null,null,null,null,null,null,null,null,null,null,null,null,null,null,null,null,null,null,null,null,null,null,null,null,null,244,"302.72   -  Female Sexual Arousal Disorder","302.72 "]
[null,"302.4   -  Exhibitionism",null,null,null,null,null,null,null,null,null,null,null,null,null,null,null,null,null,null,null,null,null,null,null,null,null,245,"302.72   -  Male Erectile Disorder","302.72 "]
[null,"302.6   -  Gender Identity Disorder in Children ",null,null,null,null,null,null,null,null,null,null,null,null,null,null,null,null,null,null,null,null,null,null,null,null,null,246,"302.73   -  Female Orgasmic Disorder","302.73 "]
[null,"302.6   -  Gender Identity Disorder NOS",null,null,null,null,null,null,null,null,null,null,null,null,null,null,null,null,null,null,null,null,null,null,null,null,null,247,"302.74   -  Male Orgasmic Disorder","302.74 "]
[null,"302.70   -  Sexual Dysfunction NOS",null,null,null,null,null,null,null,null,null,null,null,null,null,null,null,null,null,null,null,null,null,null,null,null,null,248,"302.75   -  Premature Ejaculation","302.75 "]
[null,"302.71   -  Hypoactive Sexual Desire Disorder",null,null,null,null,null,null,null,null,null,null,null,null,null,null,null,null,null,null,null,null,null,null,null,null,null,249,"302.76   -  Dyspareunia (Not Due to a General Medical Condition) ","302.76 "]
[null,"302.72   -  Female Sexual Arousal Disorder",null,null,null,null,null,null,null,null,null,null,null,null,null,null,null,null,null,null,null,null,null,null,null,null,null,250,"302.79   -  Sexual Aversion Disorder","302.79 "]
[null,"302.72   -  Male Erectile Disorder",null,null,null,null,null,null,null,null,null,null,null,null,null,null,null,null,null,null,null,null,null,null,null,null,null,251,"302.81   -  Fetishism","302.81 "]
[null,"302.73   -  Female Orgasmic Disorder",null,null,null,null,null,null,null,null,null,null,null,null,null,null,null,null,null,null,null,null,null,null,null,null,null,252,"302.82  -  Voyeurism","302.82"]
[null,"302.74   -  Male Orgasmic Disorder",null,null,null,null,null,null,null,null,null,null,null,null,null,null,null,null,null,null,null,null,null,null,null,null,null,253,"302.83   -  Sexual Masochism","302.83 "]
[null,"302.75   -  Premature Ejaculation",null,null,null,null,null,null,null,null,null,null,null,null,null,null,null,null,null,null,null,null,null,null,null,null,null,254,"302.84   -  Sexual Sadism","302.84 "]
[null,"302.76   -  Dyspareunia (Not Due to a General Medical Condition) ",null,null,null,null,null,null,null,null,null,null,null,null,null,null,null,null,null,null,null,null,null,null,null,null,null,255,"302.85   -  Gender Identity Disorder in Adolescents or Adults","302.85 "]
[null,"302.79   -  Sexual Aversion Disorder",null,null,null,null,null,null,null,null,null,null,null,null,null,null,null,null,null,null,null,null,null,null,null,null,null,256,"302.89   -  Frotteurism","302.89 "]
[null,"302.81   -  Fetishism",null,null,null,null,null,null,null,null,null,null,null,null,null,null,null,null,null,null,null,null,null,null,null,null,null,257,"302.9   -  Paraphilia NOS","302.9 "]
[null,"302.82  -  Voyeurism",null,null,null,null,null,null,null,null,null,null,null,null,null,null,null,null,null,null,null,null,null,null,null,null,null,258,"302.9   -  Sexual Disorder NOS","302.9 "]
[null,"302.83   -  Sexual Masochism",null,null,null,null,null,null,null,null,null,null,null,null,null,null,null,null,null,null,null,null,null,null,null,null,null,259,"303.00   -  Alcohol Intoxication","303.00 "]
[null,"302.84   -  Sexual Sadism",null,null,null,null,null,null,null,null,null,null,null,null,null,null,null,null,null,null,null,null,null,null,null,null,null,260,"303.90   -  Alcohol Dependence","303.90 "]
[null,"302.85   -  Gender Identity Disorder in Adolescents or Adults",null,null,null,null,null,null,null,null,null,null,null,null,null,null,null,null,null,null,null,null,null,null,null,null,null,261,"304.00   -  Opioid Dependence","304.00 "]
[null,"302.89   -  Frotteurism",null,null,null,null,null,null,null,null,null,null,null,null,null,null,null,null,null,null,null,null,null,null,null,null,null,262,"304.10   -  Sedative, Hypnotic, or Anxiolytic Dependence","304.10 "]
[null,"302.9   -  Paraphilia NOS",null,null,null,null,null,null,null,null,null,null,null,null,null,null,null,null,null,null,null,null,null,null,null,null,null,263,"304.20   -  Cocaine Dependence","304.20 "]
[null,"302.9   -  Sexual Disorder NOS",null,null,null,null,null,null,null,null,null,null,null,null,null,null,null,null,null,null,null,null,null,null,null,null,null,264,"304.30   -  Cannabis Dependence","304.30 "]
[null,"303.00   -  Alcohol Intoxication",null,null,null,null,null,null,null,null,null,null,null,null,null,null,null,null,null,null,null,null,null,null,null,null,null,265,"304.40   -  Amphetamine Dependence","304.40 "]
[null,"303.90   -  Alcohol Dependence",null,null,null,null,null,null,null,null,null,null,null,null,null,null,null,null,null,null,null,null,null,null,null,null,null,266,"304.50   -  Hallucinogen Dependence","304.50 "]
[null,"304.00   -  Opioid Dependence",null,null,null,null,null,null,null,null,null,null,null,null,null,null,null,null,null,null,null,null,null,null,null,null,null,267,"304.60   -  Inhalant Dependence","304.60 "]
[null,"304.10   -  Sedative, Hypnotic, or Anxiolytic Dependence",null,null,null,null,null,null,null,null,null,null,null,null,null,null,null,null,null,null,null,null,null,null,null,null,null,268,"304.60   -  Phencyclidine Dependence (new code as of 10/01/96) ","304.60 "]
[null,"304.20   -  Cocaine Dependence",null,null,null,null,null,null,null,null,null,null,null,null,null,null,null,null,null,null,null,null,null,null,null,null,null,269,"304.80   -  Polysubstance Dependence","304.80 "]
[null,"304.30   -  Cannabis Dependence",null,null,null,null,null,null,null,null,null,null,null,null,null,null,null,null,null,null,null,null,null,null,null,null,null,270,"304.90   -  Other (or Unknown) Substance Dependence","304.90 "]
[null,"304.40   -  Amphetamine Dependence",null,null,null,null,null,null,null,null,null,null,null,null,null,null,null,null,null,null,null,null,null,null,null,null,null,271,"305.00   -  Alcohol Abuse","305.00 "]
[null,"304.50   -  Hallucinogen Dependence",null,null,null,null,null,null,null,null,null,null,null,null,null,null,null,null,null,null,null,null,null,null,null,null,null,272,"305.10   -  Nicotine Dependence","305.10 "]
[null,"304.60   -  Inhalant Dependence",null,null,null,null,null,null,null,null,null,null,null,null,null,null,null,null,null,null,null,null,null,null,null,null,null,273,"305.20   -  Cannabis Abuse","305.20 "]
[null,"304.60   -  Phencyclidine Dependence (new code as of 10/01/96) ",null,null,null,null,null,null,null,null,null,null,null,null,null,null,null,null,null,null,null,null,null,null,null,null,null,274,"305.30   -  Hallucinogen Abuse","305.30 "]
[null,"304.80   -  Polysubstance Dependence",null,null,null,null,null,null,null,null,null,null,null,null,null,null,null,null,null,null,null,null,null,null,null,null,null,275,"305.40   -  Sedative, Hypnotic, or Anxiolytic Abuse","305.40 "]
[null,"304.90   -  Other (or Unknown) Substance Dependence",null,null,null,null,null,null,null,null,null,null,null,null,null,null,null,null,null,null,null,null,null,null,null,null,null,276,"305.50   -  Opioid Abuse","305.50 "]
[null,"305.00   -  Alcohol Abuse",null,null,null,null,null,null,null,null,null,null,null,null,null,null,null,null,null,null,null,null,null,null,null,null,null,277,"305.60   -  Cocaine Abuse","305.60 "]
[null,"305.10   -  Nicotine Dependence",null,null,null,null,null,null,null,null,null,null,null,null,null,null,null,null,null,null,null,null,null,null,null,null,null,278,"305.70   -  Amphetamine Abuse","305.70 "]
[null,"305.20   -  Cannabis Abuse",null,null,null,null,null,null,null,null,null,null,null,null,null,null,null,null,null,null,null,null,null,null,null,null,null,279,"305.90   -  Caffeine Intoxication","305.90 "]
[null,"305.30   -  Hallucinogen Abuse",null,null,null,null,null,null,null,null,null,null,null,null,null,null,null,null,null,null,null,null,null,null,null,null,null,280,"305.90   -  Inhalant Abuse","305.90 "]
[null,"305.40   -  Sedative, Hypnotic, or Anxiolytic Abuse",null,null,null,null,null,null,null,null,null,null,null,null,null,null,null,null,null,null,null,null,null,null,null,null,null,281,"305.90   -  Other (or Unknown) Substance Abuse","305.90 "]
[null,"305.50   -  Opioid Abuse",null,null,null,null,null,null,null,null,null,null,null,null,null,null,null,null,null,null,null,null,null,null,null,null,null,282,"305.90   -  Phencyclidine Abuse","305.90 "]
[null,"305.60   -  Cocaine Abuse",null,null,null,null,null,null,null,null,null,null,null,null,null,null,null,null,null,null,null,null,null,null,null,null,null,283,"306.51   -  Vaginismus (Not Due to a General Medical Condition) ","306.51 "]
[null,"305.70   -  Amphetamine Abuse",null,null,null,null,null,null,null,null,null,null,null,null,null,null,null,null,null,null,null,null,null,null,null,null,null,284,"307.0   -  Stuttering","307.0 "]
[null,"305.90   -  Caffeine Intoxication",null,null,null,null,null,null,null,null,null,null,null,null,null,null,null,null,null,null,null,null,null,null,null,null,null,285,"307.1   -  Anorexia Nervosa","307.1 "]
[null,"305.90   -  Inhalant Abuse",null,null,null,null,null,null,null,null,null,null,null,null,null,null,null,null,null,null,null,null,null,null,null,null,null,286,"307.20   -  Tic Disorder NOS","307.20 "]
[null,"305.90   -  Other (or Unknown) Substance Abuse",null,null,null,null,null,null,null,null,null,null,null,null,null,null,null,null,null,null,null,null,null,null,null,null,null,287,"307.21   -  Transient Tic Disorder","307.21 "]
[null,"305.90   -  Phencyclidine Abuse",null,null,null,null,null,null,null,null,null,null,null,null,null,null,null,null,null,null,null,null,null,null,null,null,null,288,"307.22   -  Chronic Motor or Vocal Tic Disorder","307.22 "]
[null,"306.51   -  Vaginismus (Not Due to a General Medical Condition) ",null,null,null,null,null,null,null,null,null,null,null,null,null,null,null,null,null,null,null,null,null,null,null,null,null,289,"307.23   -  Tourette's Disorder","307.23 "]
[null,"307.0   -  Stuttering",null,null,null,null,null,null,null,null,null,null,null,null,null,null,null,null,null,null,null,null,null,null,null,null,null,290,"307.3   -  Stereotypic Movement Disorder","307.3 "]
[null,"307.1   -  Anorexia Nervosa",null,null,null,null,null,null,null,null,null,null,null,null,null,null,null,null,null,null,null,null,null,null,null,null,null,291,"307.42   -  Insomnia Related to...[Indicate the Axis I or Axis IIDisorder] (before 10.01.2005)","307.42 "]
[null,"307.20   -  Tic Disorder NOS",null,null,null,null,null,null,null,null,null,null,null,null,null,null,null,null,null,null,null,null,null,null,null,null,null,292,"307.42   -  Primary Insomnia","307.42 "]
[null,"307.21   -  Transient Tic Disorder",null,null,null,null,null,null,null,null,null,null,null,null,null,null,null,null,null,null,null,null,null,null,null,null,null,293,"307.44   -  Hypersomnia Related to...[Indicate the Axis I or Axis II Disorder]  (before 10.01.2005)","307.44 "]
[null,"307.22   -  Chronic Motor or Vocal Tic Disorder",null,null,null,null,null,null,null,null,null,null,null,null,null,null,null,null,null,null,null,null,null,null,null,null,null,294,"307.44   -  Primary Hypersomnia","307.44 "]
[null,"307.23   -  Tourette's Disorder",null,null,null,null,null,null,null,null,null,null,null,null,null,null,null,null,null,null,null,null,null,null,null,null,null,295,"307.45   -  Circadian Rhythm Sleep Disorder (before 10.01.2005)","307.45 "]
[null,"307.3   -  Stereotypic Movement Disorder",null,null,null,null,null,null,null,null,null,null,null,null,null,null,null,null,null,null,null,null,null,null,null,null,null,296,"307.46   -  Sleep Terror Disorder","307.46 "]
[null,"307.42   -  Insomnia Related to...[Indicate the Axis I or Axis IIDisorder] (before 10.01.2005)",null,null,null,null,null,null,null,null,null,null,null,null,null,null,null,null,null,null,null,null,null,null,null,null,null,297,"307.46   -  Sleepwalking Disorder","307.46 "]
[null,"307.42   -  Primary Insomnia",null,null,null,null,null,null,null,null,null,null,null,null,null,null,null,null,null,null,null,null,null,null,null,null,null,298,"307.47   -  Dyssomnia NOS","307.47 "]
[null,"307.44   -  Hypersomnia Related to...[Indicate the Axis I or Axis II Disorder]  (before 10.01.2005)",null,null,null,null,null,null,null,null,null,null,null,null,null,null,null,null,null,null,null,null,null,null,null,null,null,299,"307.47   -  Nightmare Disorder","307.47 "]
[null,"307.44   -  Primary Hypersomnia",null,null,null,null,null,null,null,null,null,null,null,null,null,null,null,null,null,null,null,null,null,null,null,null,null,300,"307.47   -  Parasomnia NOS","307.47 "]
[null,"307.45   -  Circadian Rhythm Sleep Disorder (before 10.01.2005)",null,null,null,null,null,null,null,null,null,null,null,null,null,null,null,null,null,null,null,null,null,null,null,null,null,301,"307.50   -  Eating Disorder NOS","307.50 "]
[null,"307.46   -  Sleep Terror Disorder",null,null,null,null,null,null,null,null,null,null,null,null,null,null,null,null,null,null,null,null,null,null,null,null,null,302,"307.51   -  Bulimia Nervosa","307.51 "]
[null,"307.46   -  Sleepwalking Disorder",null,null,null,null,null,null,null,null,null,null,null,null,null,null,null,null,null,null,null,null,null,null,null,null,null,303,"307.52   -  Pica","307.52 "]
[null,"307.47   -  Dyssomnia NOS",null,null,null,null,null,null,null,null,null,null,null,null,null,null,null,null,null,null,null,null,null,null,null,null,null,304,"307.53   -  Rumination Disorder ","307.53 "]
[null,"307.47   -  Nightmare Disorder",null,null,null,null,null,null,null,null,null,null,null,null,null,null,null,null,null,null,null,null,null,null,null,null,null,305,"307.59   -  Feeding Disorder of Infancy or Early Childhood","307.59 "]
[null,"307.47   -  Parasomnia NOS",null,null,null,null,null,null,null,null,null,null,null,null,null,null,null,null,null,null,null,null,null,null,null,null,null,306,"307.6   -  Enuresis (Not Due to a General Medical Condition) ","307.6 "]
[null,"307.50   -  Eating Disorder NOS",null,null,null,null,null,null,null,null,null,null,null,null,null,null,null,null,null,null,null,null,null,null,null,null,null,307,"307.7   -  Encopresis, Without Constipation and Overflow Incontinence ","307.7 "]
[null,"307.51   -  Bulimia Nervosa",null,null,null,null,null,null,null,null,null,null,null,null,null,null,null,null,null,null,null,null,null,null,null,null,null,308,"307.80   -  Pain Disorder Associated With Psychological Factors ","307.80 "]
[null,"307.52   -  Pica",null,null,null,null,null,null,null,null,null,null,null,null,null,null,null,null,null,null,null,null,null,null,null,null,null,309,"307.89   -  Pain Disorder Associated With Both Psychological Factors and a General Medical Condition ","307.89 "]
[null,"307.53   -  Rumination Disorder ",null,null,null,null,null,null,null,null,null,null,null,null,null,null,null,null,null,null,null,null,null,null,null,null,null,310,"307.9   -  Communication Disorder NOS","307.9 "]
[null,"307.59   -  Feeding Disorder of Infancy or Early Childhood",null,null,null,null,null,null,null,null,null,null,null,null,null,null,null,null,null,null,null,null,null,null,null,null,null,311,"308.3   -  Acute Stress Disorder","308.3 "]
[null,"307.6   -  Enuresis (Not Due to a General Medical Condition) ",null,null,null,null,null,null,null,null,null,null,null,null,null,null,null,null,null,null,null,null,null,null,null,null,null,312,"309.0   -  Adjustment Disorder With Depressed Mood","309.0 "]
[null,"307.7   -  Encopresis, Without Constipation and Overflow Incontinence ",null,null,null,null,null,null,null,null,null,null,null,null,null,null,null,null,null,null,null,null,null,null,null,null,null,313,"309.21   -  Separation Anxiety Disorder","309.21 "]
[null,"307.80   -  Pain Disorder Associated With Psychological Factors ",null,null,null,null,null,null,null,null,null,null,null,null,null,null,null,null,null,null,null,null,null,null,null,null,null,314,"309.24   -  Adjustment Disorder With Anxiety","309.24 "]
[null,"307.89   -  Pain Disorder Associated With Both Psychological Factors and a General Medical Condition ",null,null,null,null,null,null,null,null,null,null,null,null,null,null,null,null,null,null,null,null,null,null,null,null,null,315,"309.28   -  Adjustment Disorder With Mixed Anxiety andDepressed Mood","309.28 "]
[null,"307.9   -  Communication Disorder NOS",null,null,null,null,null,null,null,null,null,null,null,null,null,null,null,null,null,null,null,null,null,null,null,null,null,316,"309.3   -  Adjustment Disorder With Disturbance of Conduct ","309.3 "]
[null,"308.3   -  Acute Stress Disorder",null,null,null,null,null,null,null,null,null,null,null,null,null,null,null,null,null,null,null,null,null,null,null,null,null,317,"309.4   -  Adjustment Disorder With Mixed Disturbance of Emotions and Conduct ","309.4 "]
[null,"309.0   -  Adjustment Disorder With Depressed Mood",null,null,null,null,null,null,null,null,null,null,null,null,null,null,null,null,null,null,null,null,null,null,null,null,null,318,"309.81   -  Posttraumatic Stress Disorder ","309.81 "]
[null,"309.21   -  Separation Anxiety Disorder",null,null,null,null,null,null,null,null,null,null,null,null,null,null,null,null,null,null,null,null,null,null,null,null,null,319,"309.9   -  Adjustment Disorder Unspecified","309.9 "]
[null,"309.24   -  Adjustment Disorder With Anxiety",null,null,null,null,null,null,null,null,null,null,null,null,null,null,null,null,null,null,null,null,null,null,null,null,null,320,"310.1   -  Personality Change Due to...[Indicate the General Medical Condition] ","310.1 "]
[null,"309.28   -  Adjustment Disorder With Mixed Anxiety andDepressed Mood",null,null,null,null,null,null,null,null,null,null,null,null,null,null,null,null,null,null,null,null,null,null,null,null,null,321,"311    -  Depressive Disorder NOS","311  "]
[null,"309.3   -  Adjustment Disorder With Disturbance of Conduct ",null,null,null,null,null,null,null,null,null,null,null,null,null,null,null,null,null,null,null,null,null,null,null,null,null,322,"312.30  -  Impulse-Control Disorder NOS","312.30"]
[null,"309.4   -  Adjustment Disorder With Mixed Disturbance of Emotions and Conduct ",null,null,null,null,null,null,null,null,null,null,null,null,null,null,null,null,null,null,null,null,null,null,null,null,null,323,"312.31   -  Pathological Gambling","312.31 "]
[null,"309.81   -  Posttraumatic Stress Disorder ",null,null,null,null,null,null,null,null,null,null,null,null,null,null,null,null,null,null,null,null,null,null,null,null,null,324,"312.32   -  Kleptomania","312.32 "]
[null,"309.9   -  Adjustment Disorder Unspecified",null,null,null,null,null,null,null,null,null,null,null,null,null,null,null,null,null,null,null,null,null,null,null,null,null,325,"312.33   -  Pyromania","312.33 "]
[null,"310.1   -  Personality Change Due to...[Indicate the General Medical Condition] ",null,null,null,null,null,null,null,null,null,null,null,null,null,null,null,null,null,null,null,null,null,null,null,null,null,326,"312.34   -  Intermittent Explosive Disorder","312.34 "]
[null,"311    -  Depressive Disorder NOS",null,null,null,null,null,null,null,null,null,null,null,null,null,null,null,null,null,null,null,null,null,null,null,null,null,327,"312.39   -  Trichotillomania","312.39 "]
[null,"312.30  -  Impulse-Control Disorder NOS",null,null,null,null,null,null,null,null,null,null,null,null,null,null,null,null,null,null,null,null,null,null,null,null,null,328,"312.81  -  Conduct Disorder Childhood-Onset Type (new code as of 10/01/96)","312.81"]
[null,"312.31   -  Pathological Gambling",null,null,null,null,null,null,null,null,null,null,null,null,null,null,null,null,null,null,null,null,null,null,null,null,null,329,"312.82  -  Conduct Disorder Adolescent-Onset Type (new code as of 10/01/96) ","312.82"]
[null,"312.32   -  Kleptomania",null,null,null,null,null,null,null,null,null,null,null,null,null,null,null,null,null,null,null,null,null,null,null,null,null,330,"312.89  -  Conduct Disorder Unspecified Onset (new code as of 10/01/96) ","312.89"]
[null,"312.33   -  Pyromania",null,null,null,null,null,null,null,null,null,null,null,null,null,null,null,null,null,null,null,null,null,null,null,null,null,331,"312.9   -  Disruptive Behavior Disorder NOS","312.9 "]
[null,"312.34   -  Intermittent Explosive Disorder",null,null,null,null,null,null,null,null,null,null,null,null,null,null,null,null,null,null,null,null,null,null,null,null,null,332,"313.23   -  Selective Mutism","313.23 "]
[null,"312.39   -  Trichotillomania",null,null,null,null,null,null,null,null,null,null,null,null,null,null,null,null,null,null,null,null,null,null,null,null,null,333,"313.81   -  Oppositional Defiant Disorder","313.81 "]
[null,"312.81  -  Conduct Disorder Childhood-Onset Type (new code as of 10/01/96)",null,null,null,null,null,null,null,null,null,null,null,null,null,null,null,null,null,null,null,null,null,null,null,null,null,334,"313.82   -  Identity Problem ","313.82 "]
[null,"312.82  -  Conduct Disorder Adolescent-Onset Type (new code as of 10/01/96) ",null,null,null,null,null,null,null,null,null,null,null,null,null,null,null,null,null,null,null,null,null,null,null,null,null,335,"313.89   -  Reactive Attachment Disorder of Infancy or Early Childhood ","313.89 "]
[null,"312.89  -  Conduct Disorder Unspecified Onset (new code as of 10/01/96) ",null,null,null,null,null,null,null,null,null,null,null,null,null,null,null,null,null,null,null,null,null,null,null,null,null,336,"313.9   -  Disorder of Infancy, Childhood, or Adolescence NOS","313.9 "]
[null,"312.9   -  Disruptive Behavior Disorder NOS",null,null,null,null,null,null,null,null,null,null,null,null,null,null,null,null,null,null,null,null,null,null,null,null,null,337,"314.00   -  Attention-Deficit/Hyperactivity Disorder, Predominantly Inattentive Type","314.00 "]
[null,"313.23   -  Selective Mutism",null,null,null,null,null,null,null,null,null,null,null,null,null,null,null,null,null,null,null,null,null,null,null,null,null,338,"314.01   -  Attention-Deficit/Hyperactivity Disorder, Combined Type ","314.01 "]
[null,"313.81   -  Oppositional Defiant Disorder",null,null,null,null,null,null,null,null,null,null,null,null,null,null,null,null,null,null,null,null,null,null,null,null,null,339,"314.01   -  Attention-Deficit/Hyperactivity Disorder, Predominantly Hyperactive-Impulsive Type ","314.01 "]
[null,"313.82   -  Identity Problem ",null,null,null,null,null,null,null,null,null,null,null,null,null,null,null,null,null,null,null,null,null,null,null,null,null,340,"314.9   -  Attention-Deficit/Hyperactivity Disorder NOS","314.9 "]
[null,"313.89   -  Reactive Attachment Disorder of Infancy or Early Childhood ",null,null,null,null,null,null,null,null,null,null,null,null,null,null,null,null,null,null,null,null,null,null,null,null,null,341,"315.00   -  Reading Disorder","315.00 "]
[null,"313.9   -  Disorder of Infancy, Childhood, or Adolescence NOS",null,null,null,null,null,null,null,null,null,null,null,null,null,null,null,null,null,null,null,null,null,null,null,null,null,342,"315.1   -  Mathematics Disorder","315.1 "]
[null,"314.00   -  Attention-Deficit/Hyperactivity Disorder, Predominantly Inattentive Type",null,null,null,null,null,null,null,null,null,null,null,null,null,null,null,null,null,null,null,null,null,null,null,null,null,343,"315.2   -  Disorder of Written Expression","315.2 "]
[null,"314.01   -  Attention-Deficit/Hyperactivity Disorder, Combined Type ",null,null,null,null,null,null,null,null,null,null,null,null,null,null,null,null,null,null,null,null,null,null,null,null,null,344,"315.31   -  Expressive Language Disorder","315.31 "]
[null,"314.01   -  Attention-Deficit/Hyperactivity Disorder, Predominantly Hyperactive-Impulsive Type ",null,null,null,null,null,null,null,null,null,null,null,null,null,null,null,null,null,null,null,null,null,null,null,null,null,345,"315.32   -  Mixed Receptive-Expressive Language Disorder (new code as of 10/01/96) ","315.32 "]
[null,"314.9   -  Attention-Deficit/Hyperactivity Disorder NOS",null,null,null,null,null,null,null,null,null,null,null,null,null,null,null,null,null,null,null,null,null,null,null,null,null,346,"315.39   -  Phonological Disorder","315.39 "]
[null,"315.00   -  Reading Disorder",null,null,null,null,null,null,null,null,null,null,null,null,null,null,null,null,null,null,null,null,null,null,null,null,null,347,"315.4   -  Developmental Coordination Disorder","315.4 "]
[null,"315.1   -  Mathematics Disorder",null,null,null,null,null,null,null,null,null,null,null,null,null,null,null,null,null,null,null,null,null,null,null,null,null,348,"315.9   -  Learning Disorder NOS","315.9 "]
[null,"315.2   -  Disorder of Written Expression",null,null,null,null,null,null,null,null,null,null,null,null,null,null,null,null,null,null,null,null,null,null,null,null,null,349,"316...  -  [Specified Psychological Factor] Affecting...[Indicate the General Medical Condition]","316..."]
[null,"315.31   -  Expressive Language Disorder",null,null,null,null,null,null,null,null,null,null,null,null,null,null,null,null,null,null,null,null,null,null,null,null,null,350,"317   -  Mild Mental Retardation","317 "]
[null,"315.32   -  Mixed Receptive-Expressive Language Disorder (new code as of 10/01/96) ",null,null,null,null,null,null,null,null,null,null,null,null,null,null,null,null,null,null,null,null,null,null,null,null,null,351,"318.0   -  Moderate Mental Retardation","318.0 "]
[null,"315.39   -  Phonological Disorder",null,null,null,null,null,null,null,null,null,null,null,null,null,null,null,null,null,null,null,null,null,null,null,null,null,352,"318.1   -  Severe Mental Retardation","318.1 "]
[null,"315.4   -  Developmental Coordination Disorder",null,null,null,null,null,null,null,null,null,null,null,null,null,null,null,null,null,null,null,null,null,null,null,null,null,353,"318.2   -  Profound Mental Retardation","318.2 "]
[null,"315.9   -  Learning Disorder NOS",null,null,null,null,null,null,null,null,null,null,null,null,null,null,null,null,null,null,null,null,null,null,null,null,null,354,"319   -  Mental Retardation, Severity Unspecified","319 "]
[null,"316...  -  [Specified Psychological Factor] Affecting...[Indicate the General Medical Condition]",null,null,null,null,null,null,null,null,null,null,null,null,null,null,null,null,null,null,null,null,null,null,null,null,null,355,"327.01  -  Sleep Disorder Due to...[Indicate the General Medical Condition], Insomnia Type  (new code as of 10.01.2005)","327.01"]
[null,"317   -  Mild Mental Retardation",null,null,null,null,null,null,null,null,null,null,null,null,null,null,null,null,null,null,null,null,null,null,null,null,null,356,"327.02  -  Insomnia Related to...[Indicate the Axis I or Axis IIDisorder] (new code as of 10.01.2005)","327.02"]
[null,"318.0   -  Moderate Mental Retardation",null,null,null,null,null,null,null,null,null,null,null,null,null,null,null,null,null,null,null,null,null,null,null,null,null,357,"327.14  -  Sleep Disorder Due to...[Indicate the General Medical Condition], Hypersomnia Type (new code as of 10.01.2005)","327.14"]
[null,"318.1   -  Severe Mental Retardation",null,null,null,null,null,null,null,null,null,null,null,null,null,null,null,null,null,null,null,null,null,null,null,null,null,358,"327.15  -  Hypersomnia Related to...[Indicate the Axis I or Axis II Disorder] (new code as of 10.01.2005)","327.15"]
[null,"318.2   -  Profound Mental Retardation",null,null,null,null,null,null,null,null,null,null,null,null,null,null,null,null,null,null,null,null,null,null,null,null,null,359,"327.30  -  Circadian Rhythm Sleep Disorder  (unspecified type) new code as of 10.01.2005","327.30"]
[null,"319   -  Mental Retardation, Severity Unspecified",null,null,null,null,null,null,null,null,null,null,null,null,null,null,null,null,null,null,null,null,null,null,null,null,null,360,"327.31  -  Circadian Rhythm Sleep Disorder (delayed sleep phase type) new code as of 10.01.2005","327.31"]
[null,"327.01  -  Sleep Disorder Due to...[Indicate the General Medical Condition], Insomnia Type  (new code as of 10.01.2005)",null,null,null,null,null,null,null,null,null,null,null,null,null,null,null,null,null,null,null,null,null,null,null,null,null,361,"327.35  -  Circadian Rhythm Sleep Disorder (jet lag type) new code as of 10.01.2005","327.35"]
[null,"327.02  -  Insomnia Related to...[Indicate the Axis I or Axis IIDisorder] (new code as of 10.01.2005)",null,null,null,null,null,null,null,null,null,null,null,null,null,null,null,null,null,null,null,null,null,null,null,null,null,362,"327.36  -  Circadian Rhythm Sleep Disorder (shift work type) new code as of 10.01.2005","327.36"]
[null,"327.14  -  Sleep Disorder Due to...[Indicate the General Medical Condition], Hypersomnia Type (new code as of 10.01.2005)",null,null,null,null,null,null,null,null,null,null,null,null,null,null,null,null,null,null,null,null,null,null,null,null,null,363,"327.44  -  Sleep Disorder Due to...[Indicate the General Medical Condition], Parasomnia Type (new code as of 10.01.2005)","327.44"]
[null,"327.15  -  Hypersomnia Related to...[Indicate the Axis I or Axis II Disorder] (new code as of 10.01.2005)",null,null,null,null,null,null,null,null,null,null,null,null,null,null,null,null,null,null,null,null,null,null,null,null,null,364,"327.8  -  Sleep Disorder Due to...[Indicate the General Medical Condition], Mixed Type (new code as of 10.01.2005)","327.8"]
[null,"327.30  -  Circadian Rhythm Sleep Disorder  (unspecified type) new code as of 10.01.2005",null,null,null,null,null,null,null,null,null,null,null,null,null,null,null,null,null,null,null,null,null,null,null,null,null,365,"332.1   -  Neuroleptic-Induced Parkinsonism","332.1 "]
[null,"327.31  -  Circadian Rhythm Sleep Disorder (delayed sleep phase type) new code as of 10.01.2005",null,null,null,null,null,null,null,null,null,null,null,null,null,null,null,null,null,null,null,null,null,null,null,null,null,366,"333.1   -  Medication-Induced Postural Tremor","333.1 "]
[null,"327.35  -  Circadian Rhythm Sleep Disorder (jet lag type) new code as of 10.01.2005",null,null,null,null,null,null,null,null,null,null,null,null,null,null,null,null,null,null,null,null,null,null,null,null,null,367,"333.7   -  Neuroleptic-Induced Acute Dystonia","333.7 "]
[null,"327.36  -  Circadian Rhythm Sleep Disorder (shift work type) new code as of 10.01.2005",null,null,null,null,null,null,null,null,null,null,null,null,null,null,null,null,null,null,null,null,null,null,null,null,null,368,"333.82   -  Neuroleptic-Induced Tardive Dyskinesia","333.82 "]
[null,"327.44  -  Sleep Disorder Due to...[Indicate the General Medical Condition], Parasomnia Type (new code as of 10.01.2005)",null,null,null,null,null,null,null,null,null,null,null,null,null,null,null,null,null,null,null,null,null,null,null,null,null,369,"333.90   -  Medication-Induced Movement Disorder NOS ","333.90 "]
[null,"327.8  -  Sleep Disorder Due to...[Indicate the General Medical Condition], Mixed Type (new code as of 10.01.2005)",null,null,null,null,null,null,null,null,null,null,null,null,null,null,null,null,null,null,null,null,null,null,null,null,null,370,"333.92   -  Neuroleptic Malignant Syndrome","333.92 "]
[null,"332.1   -  Neuroleptic-Induced Parkinsonism",null,null,null,null,null,null,null,null,null,null,null,null,null,null,null,null,null,null,null,null,null,null,null,null,null,371,"333.99   -  Neuroleptic-Induced Acute Akathisia","333.99 "]
[null,"333.1   -  Medication-Induced Postural Tremor",null,null,null,null,null,null,null,null,null,null,null,null,null,null,null,null,null,null,null,null,null,null,null,null,null,372,"347.00   -  Narcolepsy","347.00 "]
[null,"333.7   -  Neuroleptic-Induced Acute Dystonia",null,null,null,null,null,null,null,null,null,null,null,null,null,null,null,null,null,null,null,null,null,null,null,null,null,373,"607.84   -  Male Erectile Disorder Due to...[Indicate the General Medical Condition]  ","607.84 "]
[null,"333.82   -  Neuroleptic-Induced Tardive Dyskinesia",null,null,null,null,null,null,null,null,null,null,null,null,null,null,null,null,null,null,null,null,null,null,null,null,null,374,"608.89   -  Male Dyspareunia Due to...[Indicate the General Medical Condition","608.89 "]
[null,"333.90   -  Medication-Induced Movement Disorder NOS ",null,null,null,null,null,null,null,null,null,null,null,null,null,null,null,null,null,null,null,null,null,null,null,null,null,375,"608.89   -  Male Hypoactive Sexual Desire Disorder Due to...[Indicate the General Medical Condition","608.89 "]
[null,"333.92   -  Neuroleptic Malignant Syndrome",null,null,null,null,null,null,null,null,null,null,null,null,null,null,null,null,null,null,null,null,null,null,null,null,null,376,"608.89   -  Other Male Sexual Dysfunction Due to...[Indicate the General Medical Condition","608.89 "]
[null,"333.99   -  Neuroleptic-Induced Acute Akathisia",null,null,null,null,null,null,null,null,null,null,null,null,null,null,null,null,null,null,null,null,null,null,null,null,null,377,"625.0   -  Female Dyspareunia Due to...[Indicate the General Medical Condition","625.0 "]
[null,"347.00   -  Narcolepsy",null,null,null,null,null,null,null,null,null,null,null,null,null,null,null,null,null,null,null,null,null,null,null,null,null,378,"625.8   -  Female Hypoactive Sexual Desire Disorder Due to...[Indicate the General Medical Condition","625.8 "]
[null,"607.84   -  Male Erectile Disorder Due to...[Indicate the General Medical Condition]  ",null,null,null,null,null,null,null,null,null,null,null,null,null,null,null,null,null,null,null,null,null,null,null,null,null,379,"625.8   -  Other Female Sexual Dysfunction Due to...[Indicate the General Medical Condition","625.8 "]
[null,"608.89   -  Male Dyspareunia Due to...[Indicate the General Medical Condition",null,null,null,null,null,null,null,null,null,null,null,null,null,null,null,null,null,null,null,null,null,null,null,null,null,380,"780.09   -  Delirium NOS ","780.09 "]
[null,"608.89   -  Male Hypoactive Sexual Desire Disorder Due to...[Indicate the General Medical Condition",null,null,null,null,null,null,null,null,null,null,null,null,null,null,null,null,null,null,null,null,null,null,null,null,null,381,"780.52   -  Sleep Disorder Due to...[Indicate the General Medical Condition], Insomnia Type (before 10.01.2005)","780.52 "]
[null,"608.89   -  Other Male Sexual Dysfunction Due to...[Indicate the General Medical Condition",null,null,null,null,null,null,null,null,null,null,null,null,null,null,null,null,null,null,null,null,null,null,null,null,null,382,"780.54   -  Sleep Disorder Due to...[Indicate the General Medical Condition], Hypersomnia Type (before 10.01.2005)","780.54 "]
[null,"625.0   -  Female Dyspareunia Due to...[Indicate the General Medical Condition",null,null,null,null,null,null,null,null,null,null,null,null,null,null,null,null,null,null,null,null,null,null,null,null,null,383,"780.57  -  Breathing-Related Sleep Disorder (new code as of 10.01.2005)","780.57"]
[null,"625.8   -  Female Hypoactive Sexual Desire Disorder Due to...[Indicate the General Medical Condition",null,null,null,null,null,null,null,null,null,null,null,null,null,null,null,null,null,null,null,null,null,null,null,null,null,384,"780.59   -  Breathing-Related Sleep Disorder (before 10.01.2005)","780.59 "]
[null,"625.8   -  Other Female Sexual Dysfunction Due to...[Indicate the General Medical Condition",null,null,null,null,null,null,null,null,null,null,null,null,null,null,null,null,null,null,null,null,null,null,null,null,null,385,"780.59   -  Sleep Disorder Due to...[Indicate the General Medical Condition], Mixed Type ","780.59 "]
[null,"780.09   -  Delirium NOS ",null,null,null,null,null,null,null,null,null,null,null,null,null,null,null,null,null,null,null,null,null,null,null,null,null,386,"780.59   -  Sleep Disorder Due to...[Indicate the General Medical Condition], Parasomnia Type (before 10.01.2005)","780.59 "]
[null,"780.52   -  Sleep Disorder Due to...[Indicate the General Medical Condition], Insomnia Type (before 10.01.2005)",null,null,null,null,null,null,null,null,null,null,null,null,null,null,null,null,null,null,null,null,null,null,null,null,null,387,"780.9   -  Age-Related Cognitive Decline ","780.9 "]
[null,"780.54   -  Sleep Disorder Due to...[Indicate the General Medical Condition], Hypersomnia Type (before 10.01.2005)",null,null,null,null,null,null,null,null,null,null,null,null,null,null,null,null,null,null,null,null,null,null,null,null,null,388,"787.6   -  Encopresis, With Constipation and Overflow Incontinence ","787.6 "]
[null,"780.57  -  Breathing-Related Sleep Disorder (new code as of 10.01.2005)",null,null,null,null,null,null,null,null,null,null,null,null,null,null,null,null,null,null,null,null,null,null,null,null,null,389,"799.9   -  Diagnosis Deferred on Axis II","799.9 "]
[null,"780.59   -  Breathing-Related Sleep Disorder (before 10.01.2005)",null,null,null,null,null,null,null,null,null,null,null,null,null,null,null,null,null,null,null,null,null,null,null,null,null,390,"799.9   -  Diagnosis or Condition Deferred on Axis I","799.9 "]
[null,"780.59   -  Sleep Disorder Due to...[Indicate the General Medical Condition], Mixed Type ",null,null,null,null,null,null,null,null,null,null,null,null,null,null,null,null,null,null,null,null,null,null,null,null,null,391,"995.2   -  Adverse Effects of Medication NOS","995.2 "]
[null,"780.59   -  Sleep Disorder Due to...[Indicate the General Medical Condition], Parasomnia Type (before 10.01.2005)",null,null,null,null,null,null,null,null,null,null,null,null,null,null,null,null,null,null,null,null,null,null,null,null,null,392,"995.52  -  Neglect of Child (if focus of attention is on victim) (new code as of 10/01/96) ","995.52"]
[null,"780.9   -  Age-Related Cognitive Decline ",null,null,null,null,null,null,null,null,null,null,null,null,null,null,null,null,null,null,null,null,null,null,null,null,null,393,"995.53   -  Physical Abuse of Child (if focus of attention is on victim) (new code as of 10/01/96) ","995.53 "]
[null,"787.6   -  Encopresis, With Constipation and Overflow Incontinence ",null,null,null,null,null,null,null,null,null,null,null,null,null,null,null,null,null,null,null,null,null,null,null,null,null,394,"995.54  -  Physical Abuse of Child (if focus of attention is on victim) (new code as of 10/01/96) ","995.54"]
[null,"799.9   -  Diagnosis Deferred on Axis II",null,null,null,null,null,null,null,null,null,null,null,null,null,null,null,null,null,null,null,null,null,null,null,null,null,395,"995.81   -  Physical Abuse of Adult (if focus of attention is on victim)","995.81 "]
[null,"799.9   -  Diagnosis or Condition Deferred on Axis I",null,null,null,null,null,null,null,null,null,null,null,null,null,null,null,null,null,null,null,null,null,null,null,null,null,396,"995.83   -  Sexual Abuse of Adult (if focus of attention is on victim) (new code as of 10/01/96) ","995.83 "]
[null,"995.2   -  Adverse Effects of Medication NOS",null,null,null,null,null,null,null,null,null,null,null,null,null,null,null,null,null,null,null,null,null,null,null,null,null,397,"V15.81   -  Noncompliance With Treatment ","V15.81 "]
[null,"995.52  -  Neglect of Child (if focus of attention is on victim) (new code as of 10/01/96) ",null,null,null,null,null,null,null,null,null,null,null,null,null,null,null,null,null,null,null,null,null,null,null,null,null,398,"V61.10  -  Partner Relational Problem (new code as of 10/01/96) ","V61.10"]
[null,"995.53   -  Physical Abuse of Child (if focus of attention is on victim) (new code as of 10/01/96) ",null,null,null,null,null,null,null,null,null,null,null,null,null,null,null,null,null,null,null,null,null,null,null,null,null,399,"V61.12   -  Physical Abuse of Adult (if by partner) (new code as of 10/01/96)","V61.12 "]
[null,"995.54  -  Physical Abuse of Child (if focus of attention is on victim) (new code as of 10/01/96) ",null,null,null,null,null,null,null,null,null,null,null,null,null,null,null,null,null,null,null,null,null,null,null,null,null,400,"V61.12   -  Sexual Abuse of Adult (if by partner) (new code as of 10/01/96)","V61.12 "]
[null,"995.81   -  Physical Abuse of Adult (if focus of attention is on victim)",null,null,null,null,null,null,null,null,null,null,null,null,null,null,null,null,null,null,null,null,null,null,null,null,null,401,"V61.20   -  Parent-Child Relational Problem ","V61.20 "]
[null,"995.83   -  Sexual Abuse of Adult (if focus of attention is on victim) (new code as of 10/01/96) ",null,null,null,null,null,null,null,null,null,null,null,null,null,null,null,null,null,null,null,null,null,null,null,null,null,402,"V61.21   -  Neglect of Child ","V61.21 "]
[null,"V15.81   -  Noncompliance With Treatment ",null,null,null,null,null,null,null,null,null,null,null,null,null,null,null,null,null,null,null,null,null,null,null,null,null,403,"V61.21   -  Physical Abuse of Child","V61.21 "]
[null,"V61.10  -  Partner Relational Problem (new code as of 10/01/96) ",null,null,null,null,null,null,null,null,null,null,null,null,null,null,null,null,null,null,null,null,null,null,null,null,null,404,"V61.21   -  Sexual Abuse of Child","V61.21 "]
[null,"V61.12   -  Physical Abuse of Adult (if by partner) (new code as of 10/01/96)",null,null,null,null,null,null,null,null,null,null,null,null,null,null,null,null,null,null,null,null,null,null,null,null,null,405,"V61.8   -  Sibling Relational Problem ","V61.8 "]
[null,"V61.12   -  Sexual Abuse of Adult (if by partner) (new code as of 10/01/96)",null,null,null,null,null,null,null,null,null,null,null,null,null,null,null,null,null,null,null,null,null,null,null,null,null,406,"V61.9   -  Relational Problem Related to a Mental Disorder or General Medical Condition ","V61.9 "]
[null,"V61.20   -  Parent-Child Relational Problem ",null,null,null,null,null,null,null,null,null,null,null,null,null,null,null,null,null,null,null,null,null,null,null,null,null,407,"V62.2   -  Occupational Problem ","V62.2 "]
[null,"V61.21   -  Neglect of Child ",null,null,null,null,null,null,null,null,null,null,null,null,null,null,null,null,null,null,null,null,null,null,null,null,null,408,"V62.3   -  Academic Problem ","V62.3 "]
[null,"V61.21   -  Physical Abuse of Child",null,null,null,null,null,null,null,null,null,null,null,null,null,null,null,null,null,null,null,null,null,null,null,null,null,409,"V62.4   -  Acculturation Problem ","V62.4 "]
[null,"V61.21   -  Sexual Abuse of Child",null,null,null,null,null,null,null,null,null,null,null,null,null,null,null,null,null,null,null,null,null,null,null,null,null,410,"V62.81   -  Relational Problem NOS","V62.81 "]
[null,"V61.8   -  Sibling Relational Problem ",null,null,null,null,null,null,null,null,null,null,null,null,null,null,null,null,null,null,null,null,null,null,null,null,null,411,"V62.82   -  Bereavement ","V62.82 "]
[null,"V61.9   -  Relational Problem Related to a Mental Disorder or General Medical Condition ",null,null,null,null,null,null,null,null,null,null,null,null,null,null,null,null,null,null,null,null,null,null,null,null,null,412,"V62.83  -  Physical Abuse of Adult (if by person other than partner) (new code as of 10/01/96)","V62.83"]
[null,"V62.2   -  Occupational Problem ",null,null,null,null,null,null,null,null,null,null,null,null,null,null,null,null,null,null,null,null,null,null,null,null,null,413,"V62.83  -  Sexual Abuse of Adult (if by person other than partner) (new code as of 10/01/96) ","V62.83"]
[null,"V62.3   -  Academic Problem ",null,null,null,null,null,null,null,null,null,null,null,null,null,null,null,null,null,null,null,null,null,null,null,null,null,414,"V62.89   -  Borderline Intellectual Functioning ","V62.89 "]
[null,"V62.4   -  Acculturation Problem ",null,null,null,null,null,null,null,null,null,null,null,null,null,null,null,null,null,null,null,null,null,null,null,null,null,415,"V62.89   -  Phase of Life Problem ","V62.89 "]
[null,"V62.81   -  Relational Problem NOS",null,null,null,null,null,null,null,null,null,null,null,null,null,null,null,null,null,null,null,null,null,null,null,null,null,416,"V62.89   -  Religious or Spiritual Problem ","V62.89 "]
[null,"V62.82   -  Bereavement ",null,null,null,null,null,null,null,null,null,null,null,null,null,null,null,null,null,null,null,null,null,null,null,null,null,417,"V65.2   -  Malingering","V65.2 "]
[null,"V62.83  -  Physical Abuse of Adult (if by person other than partner) (new code as of 10/01/96)",null,null,null,null,null,null,null,null,null,null,null,null,null,null,null,null,null,null,null,null,null,null,null,null,null,418,"V71.01   -  Adult Antisocial Behavior","V71.01 "]
[null,"V62.83  -  Sexual Abuse of Adult (if by person other than partner) (new code as of 10/01/96) ",null,null,null,null,null,null,null,null,null,null,null,null,null,null,null,null,null,null,null,null,null,null,null,null,null,419,"V71.02   -  Child or Adolescent Antisocial Behavior ","V71.02 "]
[null,"V62.89   -  Borderline Intellectual Functioning ",null,null,null,null,null,null,null,null,null,null,null,null,null,null,null,null,null,null,null,null,null,null,null,null,null,420,"V71.09   -  No Diagnosis on Axis II","V71.09 "]
[null,"V62.89   -  Phase of Life Problem ",null,null,null,null,null,null,null,null,null,null,null,null,null,null,null,null,null,null,null,null,null,null,null,null,null,421,"V71.09   -  No Diagnosis or Condition on Axis I","V71.09 "]
[null,"V62.89   -  Religious or Spiritual Problem "]
[null,"V65.2   -  Malingering"]
[null,"V71.01   -  Adult Antisocial Behavior"]
[null,"V71.02   -  Child or Adolescent Antisocial Behavior "]
[null,"V71.09   -  No Diagnosis on Axis II"]
[null,"V71.09   -  No Diagnosis or Condition on Axis I"]

{"sheet":"DASS","index":4,"n_rows":122,"n_cols":12,"rows_kept":122,"cut":false,"hidden":false,"merged":[[26,8,26,9],[32,2,32,3],[32,4,32,5],[9,8,9,9],[10,8,10,9],[11,8,11,9],[12,8,12,9],[13,8,13,9],[14,8,14,9],[15,8,15,9],[16,8,16,9],[17,8,17,9],[18,8,18,9],[19,8,19,9],[20,8,20,9],[21,8,21,9],[0,1,0,4],[27,8,27,9],[28,8,28,9],[29,8,29,9],[30,8,30,9],[13,1,13,5],[14,1,14,5],[15,1,15,5],[16,1,16,5],[17,1,17,5],[18,1,18,5],[19,1,19,5],[20,1,20,5],[21,1,21,5],[22,1,22,5],[22,8,22,9],[28,1,28,5],[29,1,29,5],[30,1,30,5],[1,1,1,9],[23,1,23,5],[24,1,24,5],[25,1,25,5],[26,1,26,5],[27,1,27,5],[9,1,9,5],[10,1,10,5],[11,1,11,5],[12,1,12,5],[23,8,23,9],[24,8,24,9],[25,8,25,9]]}
[null,"Depression, Anxiety and Stress Scale"]
[null,"Please read each statement and circle a number 0, 1, 2 or 3 which indicates how much the statement applied to you over the past week.  There are no right or wrong answers.  Do not spend too much time on any statement.  "]
[null,"The rating scale is as follows:"]
[null,"0  Did not apply to me at all"]
[null,"1  Applied to me to some degree, or some of the time"]
[null,"2  Applied to me to a considerable degree, or a good part of time"]
[null,"3  Applied to me very much, or most of the time"]
[]
[]
["N","Item",null,null,null,null,"Score T1","Score T2","Dimension"]
[1,"I found it hard to wind down.",null,null,null,null,{"$f":"'Quest T1'!N26","v":2},{"$f":"'Quest T2'!N11","v":1},"Stress"]
[2,"I was aware of dryness of my mouth.",null,null,null,null,{"$f":"'Quest T1'!N27","v":1},{"$f":"'Quest T2'!N12","v":0},"Anxiety"]
[3,"I couldn’t seem to experience any positive feeling at all.",null,null,null,null,{"$f":"'Quest T1'!N28","v":0},{"$f":"'Quest T2'!N13","v":0},"Depression"]
[4,"I experienced breathing difficulty (eg, excessively rapid breathing, Breathlessness in the absence of physical exertion).",null,null,null,null,{"$f":"'Quest T1'!N29","v":0},{"$f":"'Quest T2'!N14","v":0},"Anxiety"]
[5,"I found it difficult to work up the initiative to do things.",null,null,null,null,{"$f":"'Quest T1'!N30","v":0},{"$f":"'Quest T2'!N15","v":0},"Depression"]
[6,"I tended to over-react to situations.",null,null,null,null,{"$f":"'Quest T1'!N31","v":1},{"$f":"'Quest T2'!N16","v":1},"Stress"]
[7,"I experienced trembling (e.g., in the hands).",null,null,null,null,{"$f":"'Quest T1'!N32","v":0},{"$f":"'Quest T2'!N17","v":0},"Anxiety"]
[8,"I felt that I was using a lot of nervous energy.",null,null,null,null,{"$f":"'Quest T1'!N33","v":2},{"$f":"'Quest T2'!N18","v":1},"Stress"]
[9,"I was worried about situations in which I might panic and make a fool of myself.",null,null,null,null,{"$f":"'Quest T1'!N34","v":2},{"$f":"'Quest T2'!N19","v":2},"Anxiety"]
[10,"I felt that I had nothing to look forward to.",null,null,null,null,{"$f":"'Quest T1'!N35","v":0},{"$f":"'Quest T2'!N20","v":0},"Depression"]
[11,"I found myself getting agitated.",null,null,null,null,{"$f":"'Quest T1'!N36","v":1},{"$f":"'Quest T2'!N21","v":1},"Stress"]
[12,"I found it difficult to relax.",null,null,null,null,{"$f":"'Quest T1'!N37","v":2},{"$f":"'Quest T2'!N22","v":1},"Stress"]
[13,"I felt down-hearted and blue.",null,null,null,null,{"$f":"'Quest T1'!N38","v":1},{"$f":"'Quest T2'!N23","v":1},"Depression"]
[14,"I was intolerant of anything that kept me from getting on with what I was doing.",null,null,null,null,{"$f":"'Quest T1'!N39","v":1},{"$f":"'Quest T2'!N24","v":0},"Stress"]
[15,"I felt I was close to panic.",null,null,null,null,{"$f":"'Quest T1'!N40","v":1},{"$f":"'Quest T2'!N25","v":1},"Anxiety"]
[16,"I was unable to become enthusiastic about anything.",null,null,null,null,{"$f":"'Quest T1'!N41","v":0},{"$f":"'Quest T2'!N26","v":0},"Depression"]
[17,"I felt I wasn’t worth much as a person.",null,null,null,null,{"$f":"'Quest T1'!N42","v":0},{"$f":"'Quest T2'!N27","v":0},"Depression"]
[18,"I felt that I was rather touchy.",null,null,null,null,{"$f":"'Quest T1'!N43","v":1},{"$f":"'Quest T2'!N28","v":1},"Stress"]
[19,"I was aware of the action of my heart in the absence of physical exertion (e.g. sense of heart increase, heart missing a beat).",null,null,null,null,{"$f":"'Quest T1'!N44","v":1},{"$f":"'Quest T2'!N29","v":0},"Anxiety"]
[20,"I felt scared without any good reason.",null,null,null,null,{"$f":"'Quest T1'!N45","v":1},{"$f":"'Quest T2'!N30","v":1},"Anxiety"]
[21,"I felt that life was meaningless.",null,null,null,null,{"$f":"'Quest T1'!N46","v":0},{"$f":"'Quest T2'!N31","v":0},"Depression"]
[]
[null,null,"T1",null,"T2",null,null,null,null,null,"Confidence level"]
[null,null,"Sum","Percentile","Sum","Percentile","d","Sdiff","RCI","d/SD","Two-tailed","One-tailed"]
[null,"Depression",{"$f":"SUM(G13,G15,G20,G23,G26,G27,G31)","v":1},{"$f":"VLOOKUP(C35,C77:G122,2)","v":43},{"$f":"SUM(H13,H15,H20,H23,H26,H27,H31)","v":1},{"$f":"VLOOKUP(E35,C77:G122,2)","v":43},{"$f":"E35-C35","v":0},{"$f":"SQRT(2*(K76*SQRT(1-L76))^2)","v":2.9320198839707761},{"$f":"G35/H35","v":0},{"$f":"G35/K76","v":0},{"$f":"IF(ABS(I35)>0.84,(1-((1-_xlfn.NORM.S.DIST(ABS(I35),TRUE))*2)),\"no change\")","v":"no change"},{"$f":"IF(ABS(I35)>0.84,_xlfn.NORM.S.DIST(ABS(I35),TRUE),\"no change\")","v":"no change"}]
[null,"Anxiety",{"$f":"SUM(G12,G14,G17,G19,G25,G29,G30)","v":6},{"$f":"VLOOKUP(C36,C77:G122,3)","v":92},{"$f":"SUM(H12,H14,H17,H19,H25,H29,H30)","v":4},{"$f":"VLOOKUP(E36,C77:G122,3)","v":86},{"$f":"E36-C36","v":-2},{"$f":"SQRT(2*(K77*SQRT(1-L77))^2)","v":1.9344443646690901},{"$f":"G36/H36","v":-1.0338886124244384},{"$f":"G36/K77","v":-0.67796610169491522},{"$f":"IF(ABS(I36)>0.84,(1-((1-_xlfn.NORM.S.DIST(ABS(I36),TRUE))*2)),\"no change\")","v":0.6988117607752109},{"$f":"IF(ABS(I36)>0.84,_xlfn.NORM.S.DIST(ABS(I36),TRUE),\"no change\")","v":0.84940588038760545}]
[null,"Stress",{"$f":"SUM(G11,G16,G18,G21,G22,G24,G28)","v":10},{"$f":"VLOOKUP(C37,C77:G122,4)","v":89},{"$f":"SUM(H11,H16,H18,H21,H22,H24,H28)","v":6},{"$f":"VLOOKUP(E37,C77:G122,4)","v":69},{"$f":"E37-C37","v":-4},{"$f":"SQRT(2*(K78*SQRT(1-L78))^2)","v":2.5685326550386707},{"$f":"G37/H37","v":-1.5573093813517345},{"$f":"G37/K78","v":-0.95238095238095233},{"$f":"IF(ABS(I37)>0.84,(1-((1-_xlfn.NORM.S.DIST(ABS(I37),TRUE))*2)),\"no change\")","v":0.88060295085756413},{"$f":"IF(ABS(I37)>0.84,_xlfn.NORM.S.DIST(ABS(I37),TRUE),\"no change\")","v":0.94030147542878206}]
[null,"Total Score",{"$f":"SUM(G11:G31)","v":17},{"$f":"VLOOKUP(C38,C77:G122,5)","v":85},{"$f":"SUM(H11:H31)","v":11},{"$f":"VLOOKUP(E38,C77:G122,5)","v":69},{"$f":"E38-C38","v":-6},{"$f":"SQRT(2*(K79*SQRT(1-L79))^2)","v":7.3186852917720149},{"$f":"G38/H38","v":-0.81981937476468103},{"$f":"G38/K79","v":-0.6211180124223602},{"$f":"IF(ABS(I38)>0.84,(1-((1-_xlfn.NORM.S.DIST(ABS(I38),TRUE))*2)),\"no change\")","v":"no change"},{"$f":"IF(ABS(I38)>0.84,_xlfn.NORM.S.DIST(ABS(I38),TRUE),\"no change\")","v":"no change"}]
[]
[]
[]
[]
[]
[]
[]
[]
[]
[]
[]
[]
[]
[]
[]
[]
[]
[]
[]
[]
[]
[]
[]
[]
[]
[]
[]
[]
[]
[]
[]
[]
[]
[]
[]
[null,null,null,null,null,null,null,null,"Henry & Crawford, 2005"]
[null,null,"Normes",null,null,null,null,null,"Norms","M","SD","rxx"]
[null,null,"Percentiles",null,null,null,null,null,"Depression",2.83,3.87,0.71299999999999997]
[null,null,"Raw score","Depression","Anxiety","Stress","Total",null,"Anxiété",1.88,2.95,0.78500000000000003]
[null,null,0,34,44,15,9,null,"Stress",4.7300000000000004,4.2,0.81299999999999994]
[null,null,1,43,54,20,12,null,"Total",9.43,9.66,0.71299999999999997]
[null,null,2,58,69,30,19]
[null,null,3,68,79,41,27]
[null,null,4,75,86,51,33]
[null,null,5,81,89,60,40]
[null,null,6,85,92,69,46]
[null,null,7,88,94,77,51]
[null,null,8,91,95,82,57]
[null,null,9,92,96,86,61]
[null,null,10,93,97,89,65]
[null,null,11,95,97,92,69]
[null,null,12,96,98,93,73]
[null,null,13,97,99,95,76]
[null,null,14,97,99,96,79]
[null,null,15,98,99,97,81]
[null,null,16,98,99,97,83]
[null,null,17,99,">99",98,85]
[null,null,18,">99",">99",99,87]
[null,null,19,">99",">99",99,88]
[null,null,20,">99",">99",">99",89]
[null,null,21,">99",">99",">99",90]
[null,null,22,null,null,null,91]
[null,null,23,null,null,null,91]
[null,null,24,null,null,null,92]
[null,null,25,null,null,null,93]
[null,null,26,null,null,null,94]
[null,null,27,null,null,null,94]
[null,null,28,null,null,null,95]
[null,null,29,null,null,null,95]
[null,null,30,null,null,null,95]
[null,null,31,null,null,null,95]
[null,null,32,null,null,null,96]
[null,null,33,null,null,null,96]
[null,null,34,null,null,null,96]
[null,null,35,null,null,null,97]
[null,null,36,null,null,null,97]
[null,null,37,null,null,null,97]
[null,null,38,null,null,null,98]
[null,null,39,null,null,null,98]
[null,null,40,null,null,null,98]
[null,null,41,null,null,null,98]
[null,null,42,null,null,null,98]
[null,null,43,null,null,null,99]
[null,null,44,null,null,null,">99"]

{"sheet":"REQ","index":5,"n_rows":299,"n_cols":28,"rows_kept":299,"cut":false,"hidden":false,"merged":[[11,0,11,3],[12,0,12,3],[13,0,13,3],[14,0,14,3],[15,0,15,3],[2,0,3,2],[7,0,7,3],[8,0,8,3],[9,0,9,3],[10,0,10,3],[29,11,29,12],[29,1,29,3],[29,4,29,6],[25,6,25,7],[26,6,26,7],[27,6,27,7],[27,8,27,11],[25,0,25,3],[26,0,26,3],[27,0,27,3],[26,8,26,11],[6,8,6,11],[7,8,7,11],[8,8,8,11],[9,8,9,11],[10,8,10,11],[11,8,11,11],[12,8,12,11],[13,8,13,11],[14,8,14,11],[15,8,15,11],[16,8,16,11],[1,0,1,10],[0,0,0,4],[23,6,23,7],[6,0,6,3],[4,0,4,10],[16,0,16,3],[17,0,17,3],[18,0,18,3],[6,6,6,7],[7,6,7,7],[8,6,8,7],[9,6,9,7],[10,6,10,7],[11,6,11,7],[12,6,12,7],[24,6,24,7],[21,6,21,7],[22,6,22,7],[19,0,19,3],[20,0,20,3],[21,0,21,3],[22,0,22,3],[23,0,23,3],[24,0,24,3],[13,6,13,7],[14,6,14,7],[15,6,15,7],[16,6,16,7],[17,6,17,7],[18,6,18,7],[19,6,19,7],[20,6,20,7],[17,8,17,11],[18,8,18,11],[19,8,19,11],[20,8,20,11],[21,8,21,11],[22,8,22,11],[23,8,23,11],[24,8,24,11],[25,8,25,11]]}
["Revised Regulation of Emotions Questionnaire"]
["We all experience many different feelings or emotions. For example, different things in our lives make us happy, sad, angry, etc."]
["\nThe following questionnaire asks you about how often you do certain things in response to your emotions. You do not have to think about specific emotions but just how often you generally do the things listed below.",null,null,null,"Never=1","Seldom=2","Often=3","Very often=4","Always=5"]
[]
["Please tick the box corresponding to the answer that fits best. We all respond to our emotions in different ways so there are no right or wrong answers."]
[]
["Item",null,null,null,"Score T1","Score T2","Dimension",null,"Strategies"]
["1.      I talk to someone about how I feel",null,null,null,{"$f":"'Quest T1'!N51","v":3},{"$f":"'Quest T2'!N36","v":3},"Functional - External",null,"expression of feelings"]
["2.      I take my feelings out on others verbally (e.g., shouting, arguing). ",null,null,null,{"$f":"'Quest T1'!N52","v":2},{"$f":"'Quest T2'!N37","v":2},"Dysfunctional - External",null,"verbal assault"]
["3.      I seek physical contact from friends of family (e.g., a hug, hold hands).",null,null,null,{"$f":"'Quest T1'!N53","v":2},{"$f":"'Quest T2'!N38","v":1},"Functional - External",null,"physical contact"]
["4.      I reviews (rethink) my thoughts or beliefs.",null,null,null,{"$f":"'Quest T1'!N54","v":3},{"$f":"'Quest T2'!N39","v":4},"Functional - Internal",null,"positive re-appraisal"]
["5.      I harm or punish myself in some way.",null,null,null,{"$f":"'Quest T1'!N55","v":2},{"$f":"'Quest T2'!N40","v":1},"Dysfunctional - Internal",null,"self-harm"]
["6.      I do something energetic (e.g., play sport, go for a walk).",null,null,null,{"$f":"'Quest T1'!N56","v":2},{"$f":"'Quest T2'!N41","v":1},"Functional - External",null,"exercise"]
["7.      I dwell on my thoughts and feelings (e.g., It goes round and round in my head and I can’t stop it).",null,null,null,{"$f":"'Quest T1'!N57","v":4},{"$f":"'Quest T2'!N42","v":3},"Dysfunctional - Internal",null,"rumination"]
["8.      I ask others for advice.",null,null,null,{"$f":"'Quest T1'!N58","v":3},{"$f":"'Quest T2'!N43","v":3},"Functional - External",null,"advice seeking"]
["9.      I review (rethink) my goals or plans. ",null,null,null,{"$f":"'Quest T1'!N59","v":2},{"$f":"'Quest T2'!N44","v":2},"Functional - Internal",null,"modification of goals"]
["10.  I take my feelings out on others physically (e.g., fighting, lashing out). ",null,null,null,{"$f":"'Quest T1'!N60","v":1},{"$f":"'Quest T2'!N45","v":1},"Dysfunctional - External",null,"physical assault"]
["11.  I put the situation into perspective.",null,null,null,{"$f":"'Quest T1'!N61","v":3},{"$f":"'Quest T2'!N46","v":2},"Functional - Internal",null,"perspective"]
["12.  I concentrate on a pleasant activity. ",null,null,null,{"$f":"'Quest T1'!N62","v":1},{"$f":"'Quest T2'!N47","v":2},"Functional - Internal",null,"concentration"]
["13.  I try to make others feel bad (e.g., being rude, ignoring them). ",null,null,null,{"$f":"'Quest T1'!N63","v":2},{"$f":"'Quest T2'!N48","v":1},"Dysfunctional - External",null,"making others feel bad"]
["14.  I think about people better off and make myself feel worse.",null,null,null,{"$f":"'Quest T1'!N64","v":2},{"$f":"'Quest T2'!N49","v":1},"Dysfunctional - Internal",null,"negative social comparison"]
["15.  I keep the feeling locked up inside. ",null,null,null,{"$f":"'Quest T1'!N65","v":2},{"$f":"'Quest T2'!N50","v":2},"Dysfunctional - Internal",null,"repression"]
["16.  I plan what I could do better next time.",null,null,null,{"$f":"'Quest T1'!N66","v":3},{"$f":"'Quest T2'!N51","v":3},"Functional - Internal",null,"planning"]
["17.  I bully other people (e.g. saying nasty things to them, hitting them)",null,null,null,{"$f":"'Quest T1'!N67","v":1},{"$f":"'Quest T2'!N52","v":1},"Dysfunctional - External",null,"bullying"]
["18.  I take my feelings out on objects around me (e.g., deliberately causing damage to my house, school or outdoor things). ",null,null,null,{"$f":"'Quest T1'!N68","v":1},{"$f":"'Quest T2'!N53","v":1},"Dysfunctional - External",null,"lashing out at objects"]
["19.  Things feel unreal (e.g., I feel strange, things around me feel strange, I daydream).",null,null,null,{"$f":"'Quest T1'!N69","v":1},{"$f":"'Quest T2'!N54","v":1},"Dysfunctional - Internal",null,"de-realisation"]
["20.  I telephone friends or family. ",null,null,null,{"$f":"'Quest T1'!N70","v":2},{"$f":"'Quest T2'!N55","v":2},"Functional - External",null,"new item 1"]
["21.  I go out and do something nice (e.g., cinema, shopping, go for a meal, meet people). ",null,null,null,{"$f":"'Quest T1'!N71","v":3},{"$f":"'Quest T2'!N56","v":3},"Functional - External",null,"new item 2"]
[]
[null,"T1",null,null,"T2",null,null,null,null,null,null,"Confidence level"]
[null,"Mean","Sum","Percentile","Mean","Sum","Percentile","d","Sdiff","RCI","d/SD","Two-tailed","One-tailed"]
["Functional - Internal",{"$f":"AVERAGE(E11,E16,E18,E19,E23)","v":2.4},{"$f":"SUM(E11,E16,E18,E19,E23)","v":12},{"$f":"NORMDIST($B$32,$B$115,$C$115,TRUE)*100","v":24.196365222307282},{"$f":"AVERAGE(F11,F16,F18,F19,F23)","v":2.6},{"$f":"SUM(F11,F16,F18,F19,F23)","v":13},{"$f":"NORMDIST($E$32,$B$115,$C$115,TRUE)*100","v":33.933243740422732},{"$f":"E32-B32","v":0.20000000000000018},{"$f":"SQRT(2*(C115*SQRT(1-D115))^2)","v":0.70000000000000007},{"$f":"H32/I32","v":0.28571428571428592},{"$f":"H32/C115","v":0.28571428571428598},{"$f":"IF(ABS(J32)>0.84,(1-((1-_xlfn.NORM.S.DIST(ABS(J32),TRUE))*2)),\"no change\")","v":"no change"},{"$f":"IF(ABS(J32)>0.84,_xlfn.NORM.S.DIST(ABS(J32),TRUE),\"no change\")","v":"no change"}]
["Functional - External",{"$f":"AVERAGE(E8,E10,E13,E15,E27,E28)","v":2.5},{"$f":"SUM(E8,E10,E13,E15,E27,E28)","v":15},{"$f":"NORMDIST($B$33,$B$116,$C$116,TRUE)*100","v":33.807536853187749},{"$f":"AVERAGE(F8,F10,F13,F15,F27,F28)","v":2.1666666666666665},{"$f":"SUM(F8,F10,F13,F15,F27,F28)","v":13},{"$f":"NORMDIST($E$33,$B$116,$C$116,TRUE)*100","v":20.054883749815982},{"$f":"E33-B33","v":-0.33333333333333348},{"$f":"SQRT(2*(C116*SQRT(1-D116))^2)","v":0.79000000000000015},{"$f":"H33/I33","v":-0.42194092827004231},{"$f":"H33/C116","v":-0.42194092827004237},{"$f":"IF(ABS(J33)>0.84,(1-((1-_xlfn.NORM.S.DIST(ABS(J33),TRUE))*2)),\"no change\")","v":"no change"},{"$f":"IF(ABS(J33)>0.84,_xlfn.NORM.S.DIST(ABS(J33),TRUE),\"no change\")","v":"no change"}]
["Dysfunctional - Internal",{"$f":"AVERAGE(E12,E14,E21,E22,E26)","v":2.2000000000000002},{"$f":"SUM(E12,E14,E21,E22,E26)","v":11},{"$f":"NORMDIST($B$34,$B$117,$C$117,TRUE)*100","v":57.366558758326747},{"$f":"AVERAGE(F12,F14,F21,F22,F26)","v":1.6},{"$f":"SUM(F12,F14,F21,F22,F26)","v":8},{"$f":"NORMDIST($E$34,$B$117,$C$117,TRUE)*100","v":25.097377432344313},{"$f":"E34-B34","v":-0.60000000000000009},{"$f":"SQRT(2*(C117*SQRT(1-D117))^2)","v":0.70000000000000007},{"$f":"H34/I34","v":-0.85714285714285721},{"$f":"H34/C117","v":-0.85714285714285732},{"$f":"IF(ABS(J34)>0.84,(1-((1-_xlfn.NORM.S.DIST(ABS(J34),TRUE))*2)),\"no change\")","v":0.60863406169244816},{"$f":"IF(ABS(J34)>0.84,_xlfn.NORM.S.DIST(ABS(J34),TRUE),\"no change\")","v":0.80431703084622408}]
["Dysfunctional - External",{"$f":"AVERAGE(E9,E17,E20,E24,E25)","v":1.4},{"$f":"SUM(E9,E17,E20,E24,E25)","v":7},{"$f":"NORMDIST($B$35,$B$118,$C$118,TRUE)*100","v":38.858118677602818},{"$f":"AVERAGE(F9,F17,F20,F24,F25)","v":1.2},{"$f":"SUM(F9,F17,F20,F24,F25)","v":6},{"$f":"NORMDIST($E$35,$B$118,$C$118,TRUE)*100","v":25.450584907026062},{"$f":"E35-B35","v":-0.19999999999999996},{"$f":"SQRT(2*(C118*SQRT(1-D118))^2)","v":0.53000000000000014},{"$f":"H35/I35","v":-0.37735849056603754},{"$f":"H35/C118","v":-0.37735849056603765},{"$f":"IF(ABS(J35)>0.84,(1-((1-_xlfn.NORM.S.DIST(ABS(J35),TRUE))*2)),\"no change\")","v":"no change"},{"$f":"IF(ABS(J35)>0.84,_xlfn.NORM.S.DIST(ABS(J35),TRUE),\"no change\")","v":"no change"}]
[]
[]
[]
[]
[]
[]
[]
[]
[]
[]
[]
[]
[]
[]
[]
[]
[]
[]
[]
[]
[]
[]
[]
[]
[]
[]
[]
[]
[]
[]
[]
[]
[]
[]
[]
[]
[]
[]
[]
[]
[]
[]
[]
[]
[]
[]
[]
[]
[]
[]
[]
[]
[]
[]
[]
[]
[]
[]
[]
[]
[]
[]
[]
[]
[]
[]
[]
[]
[]
[]
[]
[]
[]
[]
[]
[]
[]
[]
["Normes (Phillips & Power, 2007, p.152)","M","SD","rxx"]
["Functional - Internal",2.89,0.7,0.5]
["Functional - External",2.83,0.79,0.5]
["Dysfunctional - Internal",2.0699999999999998,0.7,0.5]
["Dysfunctional - External",1.55,0.53,0.5]
[]
[]
[]
[]
[]
[]
[]
[]
[]
[]
[]
[]
[]
[]
[]
[]
[]
[]
[]
[]
[]
[]
[]
[]
[]
[]
[]
[]
[]
[]
[]
[]
[]
[]
[null,"Fonctionnel interne",null,null,null,null,null,"Fonctionnel externe",null,null,null,null,null,null,null,"Dysfonctionnel interne",null,null,null,null,null,null,null,"Dysfonctionnel externe"]
[null,null,null,"x","densité",null,null,null,null,"x","densité",null,null,null,null,null,null,"x","densité",null,null,null,null,null,null,"x","densité"]
[null,-30,{"$f":"B155*$C$115/10","v":-2.1},{"$f":"C155+$B$115","v":0.79},{"$f":"NORMDIST(D155,$B$115,$C$115,FALSE)","v":6.3312120170542852E-3},1,null,-30,{"$f":"H155*$C$116/10","v":-2.37},{"$f":"I155+$B$116","v":0.45999999999999996},{"$f":"NORMDIST(J155,$B$116,$C$116,FALSE)","v":5.6099346986557049E-3},1,null,null,null,-30,{"$f":"P155*$C$117/10","v":-2.1},{"$f":"Q155+$B$117","v":-3.0000000000000249E-2},{"$f":"NORMDIST(R155,$B$117,$C$117,FALSE)","v":6.3312120170542852E-3},1,null,null,null,-30,{"$f":"X155*$C$118/10","v":-1.59},{"$f":"Y155+$B$118","v":-4.0000000000000036E-2},{"$f":"NORMDIST(Z155,$B$118,$C$118,FALSE)","v":8.3619781357320896E-3},1]
[null,{"$f":"B155+0.5","v":-29.5},-2.0649999999999999,0.82500000000000018,7.3466298900770567E-3,2,null,{"$f":"H155+0.5","v":-29.5},-2.3304999999999998,0.49950000000000028,6.5096720544986619E-3,2,null,null,null,{"$f":"P155+0.5","v":-29.5},-2.0649999999999999,4.9999999999998934E-3,7.3466298900770567E-3,2,null,null,null,{"$f":"X155+0.5","v":-29.5},-1.5635000000000001,-1.3500000000000068E-2,9.7030960812338456E-3,2]
[null,{"$f":"B156+0.5","v":-29},-2.0299999999999998,0.86000000000000032,8.5036177425369345E-3,3,null,{"$f":"H156+0.5","v":-29},-2.2909999999999999,0.53900000000000015,7.5348511642732326E-3,3,null,null,null,{"$f":"P156+0.5","v":-29},-2.0299999999999998,4.0000000000000036E-2,8.5036177425369345E-3,3,null,null,null,{"$f":"X156+0.5","v":-29},-1.5370000000000001,1.2999999999999901E-2,1.12311932448601E-2,3]
[null,-28.5,-1.9949999999999999,0.89500000000000024,9.8182381294485317E-3,4,null,-28.5,-2.2515000000000001,0.57850000000000001,8.6997046716632536E-3,4,null,null,null,-28.5,-1.9949999999999999,7.4999999999999956E-2,9.8182381294485317E-3,4,null,null,null,-28.5,-1.5105,3.9500000000000091E-2,1.2967484321913164E-2,4]
[null,-28,-1.9599999999999997,0.93000000000000038,1.1307787975685669E-2,5,null,-28,-2.2120000000000002,0.61799999999999988,1.0019558965797414E-2,5,null,null,null,-28,-1.9599999999999997,0.1100000000000001,1.1307787975685669E-2,5,null,null,null,-28,-1.484,6.6000000000000059E-2,1.4934814307509373E-2,5]
[null,-27.5,-1.925,0.96500000000000008,1.2990803573701488E-2,6,null,-27.5,-2.1725000000000003,0.65749999999999975,1.1510838609608913E-2,6,null,null,null,-27.5,-1.925,0.1449999999999998,1.2990803573701488E-2,6,null,null,null,-27.5,-1.4575,9.2500000000000027E-2,1.7157665097341606E-2,6]
[null,-27,-1.89,1.0000000000000002,1.4887049734889416E-2,7,null,-27,-2.133,0.69700000000000006,1.319105672711722E-2,7,null,null,null,-27,-1.89,0.17999999999999994,1.4887049734889416E-2,7,null,null,null,-27,-1.431,0.11899999999999999,1.9662141159287907E-2,7]
[null,-26.5,-1.8549999999999998,1.0350000000000004,1.7017490868007398E-2,8,null,-26.5,-2.0935000000000001,0.73649999999999993,1.5078789376715414E-2,8,null,null,null,-26.5,-1.8549999999999998,0.21500000000000008,1.7017490868007398E-2,8,null,null,null,-26.5,-1.4045000000000001,0.14549999999999996,2.2475931335104109E-2,8]
[null,-26,-1.8199999999999998,1.0700000000000003,1.9404241762408021E-2,9,null,-26,-2.0539999999999998,0.77600000000000025,1.7193631941374219E-2,9,null,null,null,-26,-1.8199999999999998,0.25,1.9404241762408021E-2,9,null,null,null,-26,-1.3780000000000001,0.17199999999999993,2.5628243837142666E-2,9]
[null,-25.5,-1.7849999999999997,1.1050000000000004,2.2070495906278822E-2,10,null,-25.5,-2.0145,0.81550000000000011,1.9556135613158446E-2,10,null,null,null,-25.5,-1.7849999999999997,0.28500000000000014,2.2070495906278822E-2,10,null,null,null,-25.5,-1.3515000000000001,0.1984999999999999,2.9149711574330488E-2,10]
[null,-25,-1.75,1.1400000000000001,2.5040429276526485E-2,11,null,-25,-1.9750000000000001,0.85499999999999998,2.2187722143757645E-2,11,null,null,null,-25,-1.75,0.31999999999999984,2.5040429276526485E-2,11,null,null,null,-25,-1.325,0.22500000000000009,3.3072265082204788E-2,11]
[null,-24.5,-1.7149999999999999,1.1750000000000003,2.8339077702564771E-2,12,null,-24.5,-1.9355,0.89450000000000007,2.5110575179487768E-2,12,null,null,null,-24.5,-1.7149999999999999,0.35499999999999998,2.8339077702564771E-2,12,null,null,null,-24.5,-1.2985000000000002,0.25149999999999983,3.7428970550557189E-2,12]
[null,-24,-1.6799999999999997,1.2100000000000004,3.1992186135489861E-2,13,null,-24,-1.8960000000000001,0.93399999999999994,2.8347506702332787E-2,13,null,null,null,-24,-1.6799999999999997,0.39000000000000012,3.1992186135489861E-2,13,null,null,null,-24,-1.272,0.27800000000000002,4.2253830744986599E-2,13]
[null,-23.5,-1.645,1.2450000000000001,3.6026028450277692E-2,14,null,-23.5,-1.8565,0.97350000000000003,3.1921797361005547E-2,14,null,null,null,-23.5,-1.645,0.42499999999999982,3.6026028450277692E-2,14,null,null,null,-23.5,-1.2455000000000001,0.30449999999999999,4.7581547009800718E-2,14]
[null,-23,-1.6099999999999999,1.2800000000000002,4.0467196773715984E-2,15,null,-23,-1.8170000000000002,1.0129999999999999,3.5857009799495139E-2,15,null,null,null,-23,-1.6099999999999999,0.45999999999999996,4.0467196773715984E-2,15,null,null,null,-23,-1.2190000000000001,0.33099999999999996,5.3447241021889032E-2,15]
[null,-22.5,-1.5749999999999997,1.3150000000000004,4.5342359765239211E-2,16,null,-22.5,-1.7775000000000003,1.0524999999999998,4.0176774475528337E-2,16,null,null,null,-22.5,-1.5749999999999997,0.49500000000000011,4.5342359765239211E-2,16,null,null,null,-22.5,-1.1925000000000001,0.35749999999999993,5.9886135538995126E-2,16]
[null,-22,-1.5399999999999998,1.3500000000000003,5.0677989780330661E-2,17,null,-22,-1.7380000000000002,1.0919999999999999,4.4904547906622051E-2,17,null,null,null,-22,-1.5399999999999998,0.53,5.0677989780330661E-2,17,null,null,null,-22,-1.1659999999999999,0.38400000000000012,6.6933194049493314E-2,17]
[null,-21.5,-1.5049999999999999,1.3850000000000002,5.6500059413386032E-2,18,null,-21.5,-1.6984999999999999,1.1315000000000002,5.0063343784012934E-2,18,null,null,null,-21.5,-1.5049999999999999,0.56499999999999995,5.6500059413386032E-2,18,null,null,null,-21.5,-1.1395000000000002,0.41049999999999986,7.4622719979943755E-2,18]
[null,-21,-1.47,1.4200000000000002,6.2833708543467412E-2,19,null,-21,-1.659,1.171,5.5675437949907834E-2,19,null,null,null,-21,-1.47,0.59999999999999987,6.2833708543467412E-2,19,null,null,null,-21,-1.113,0.43700000000000006,8.2987916944202239E-2,19]
[null,-20.5,-1.4350000000000001,1.4550000000000001,6.9702883684546746E-2,20,null,-20.5,-1.6194999999999999,1.2105000000000001,6.1762048834408563E-2,20,null,null,null,-20.5,-1.4350000000000001,0.63499999999999979,6.9702883684546746E-2,20,null,null,null,-20.5,-1.0865,0.46350000000000002,9.2060412413552395E-2,20]
[null,-20,-1.4,1.4900000000000002,7.7129952161697241E-2,21,null,-20,-1.58,1.25,6.8342995586313987E-2,21,null,null,null,-20,-1.4,0.66999999999999993,7.7129952161697241E-2,21,null,null,null,-20,-1.06,0.49,0.10186974813809067,21]
[null,-19.5,-1.3649999999999998,1.5250000000000004,8.5135294384023022E-2,22,null,-19.5,-1.5405000000000002,1.2894999999999999,7.5436336795969686E-2,22,null,null,null,-19.5,-1.3649999999999998,0.70500000000000007,8.5135294384023022E-2,22,null,null,null,-19.5,-1.0335000000000001,0.51649999999999996,0.11244284163927561,22]
[null,-19,-1.3299999999999998,1.5600000000000003,9.3736878249537997E-2,23,null,-19,-1.5010000000000001,1.329,8.3057993385666565E-2,23,null,null,null,-19,-1.3299999999999998,0.74,9.3736878249537997E-2,23,null,null,null,-19,-1.0070000000000001,0.54299999999999993,0.12380342410316336,23]
[null,-18.5,-1.2949999999999999,1.5950000000000002,0.10294982048031141,24,null,-18.5,-1.4615,1.3685,9.1221359919263306E-2,24,null,null,null,-18.5,-1.2949999999999999,0.77499999999999991,0.10294982048031141,24,null,null,null,-18.5,-0.98049999999999993,0.56950000000000012,0.1359714610117321,24]
[null,-18,-1.26,1.6300000000000001,0.1127859404298488,25,null,-18,-1.4220000000000002,1.4079999999999999,9.9936909241638158E-2,25,null,null,null,-18,-1.26,0.80999999999999983,0.1127859404298488,25,null,null,null,-18,-0.95400000000000007,0.59599999999999997,0.14896256283187576,25]
[null,-17.5,-1.2250000000000001,1.665,0.12325331260930211,26,null,-17.5,-1.3825000000000001,1.4475,0.10921179598292599,26,null,null,null,-17.5,-1.2250000000000001,0.84499999999999975,0.12325331260930211,26,null,null,null,-17.5,-0.92749999999999999,0.62250000000000005,0.1627873940122859,26]
[null,-17,-1.19,1.7000000000000002,0.13435582482412423,27,null,-17,-1.343,1.4870000000000001,0.1190494650340341,27,null,null,null,-17,-1.19,0.87999999999999989,0.13435582482412423,27,null,null,null,-17,-0.90100000000000002,0.64900000000000002,0.17745108939035273,27]
[null,-16.5,-1.1549999999999998,1.7350000000000003,0.14609274937711147,28,null,-16.5,-1.3035000000000001,1.5265,0.12944927159997213,28,null,null,null,-16.5,-1.1549999999999998,0.91500000000000004,0.14609274937711147,28,null,null,null,-16.5,-0.87450000000000006,0.67549999999999999,0.1929526878565623,28]
[null,-16,-1.1199999999999999,1.7700000000000002,0.15845833525636513,29,null,-16,-1.264,1.5660000000000001,0.14040611984741214,29,null,null,null,-16,-1.1199999999999999,0.95,0.15845833525636513,29,null,null,null,-16,-0.84800000000000009,0.70199999999999996,0.20928459373482178,29]
[null,-15.5,-1.085,1.8050000000000002,0.17144142956712227,30,null,-15.5,-1.2245000000000001,1.6054999999999999,0.15191012746453872,30,null,null,null,-15.5,-1.085,0.98499999999999988,0.17144142956712227,30,null,null,null,-15.5,-0.82150000000000001,0.72850000000000004,0.22643207678676525,30]
[null,-15,-1.05,1.84,0.18502513666555956,31,null,-15,-1.1850000000000001,1.645,0.16394632362771105,31,null,null,null,-15,-1.05,1.0199999999999998,0.18502513666555956,31,null,null,null,-15,-0.79500000000000004,0.755,0.24437282201111646,31]
[null,-14.5,-1.0149999999999999,1.8750000000000002,0.19918652349337185,32,null,-14.5,-1.1455,1.6845000000000001,0.17649438790551933,32,null,null,null,-14.5,-1.0149999999999999,1.0549999999999999,0.19918652349337185,32,null,null,null,-14.5,-0.76850000000000007,0.78149999999999997,0.26307654046294388,32]
[null,-14,{"$f":"B187*$C$115/10","v":-0.97999999999999987},{"$f":"C187+$B$115","v":1.9100000000000001},{"$f":"NORMDIST(D187,$B$115,$C$115,FALSE)","v":0.21389637947963547},33,null,-14,{"$f":"H187*$C$116/10","v":-1.1060000000000001},{"$f":"I187+$B$116","v":1.724},{"$f":"NORMDIST(J187,$B$116,$C$116,FALSE)","v":0.18952843751360104},33,null,null,null,-14,{"$f":"P187*$C$117/10","v":-0.97999999999999987},{"$f":"Q187+$B$117","v":1.0899999999999999},{"$f":"NORMDIST(R187,$B$117,$C$117,FALSE)","v":0.21389637947963547},33,null,null,null,-14,{"$f":"X187*$C$118/10","v":-0.74199999999999999},{"$f":"Y187+$B$118","v":0.80800000000000005},{"$f":"NORMDIST(Z187,$B$118,$C$118,FALSE)","v":0.28250465214291487},33]
[null,-13.5,-0.94499999999999995,1.9450000000000003,0.22911903905988518,34,null,-13.5,-1.0665,1.7635000000000001,0.20301687005306282,34,null,null,null,-13.5,-0.94499999999999995,1.125,0.22911903905988518,34,null,null,null,-13.5,-0.71550000000000002,0.83450000000000002,0.3026100515885275,34]
[null,-13,-0.90999999999999992,1.9800000000000002,0.24481227435401051,35,null,-13,-1.0269999999999999,1.8030000000000002,0.21692226841494611,35,null,null,null,-13,-0.90999999999999992,1.1599999999999999,0.24481227435401051,35,null,null,null,-13,-0.68900000000000006,0.86099999999999999,0.32333696612793839,35]
[null,-12.5,-0.875,2.0150000000000001,0.26092726484145989,36,null,-12.5,-0.98750000000000004,1.8425,0.23120137391015433,36,null,null,null,-12.5,-0.875,1.1949999999999998,0.26092726484145989,36,null,null,null,-12.5,-0.66249999999999998,0.88750000000000007,0.34462091582834325,36]
[null,-12,-0.83999999999999986,2.0500000000000003,0.27740864997601855,37,null,-12,-0.94800000000000006,1.8820000000000001,0.245805132890143,37,null,null,null,-12,-0.83999999999999986,1.23,0.27740864997601855,37,null,null,null,-12,-0.63600000000000001,0.91400000000000003,0.36638878298719424,37]
[null,-11.5,-0.80499999999999994,2.085,0.29419466959996382,38,null,-11.5,-0.90850000000000009,1.9215,0.26067882116452495,38,null,null,null,-11.5,-0.80499999999999994,1.2649999999999999,0.29419466959996399,38,null,null,null,-11.5,-0.60950000000000004,0.9405,0.38855899758485807,38]
[null,-11,-0.76999999999999991,2.12,0.3112173957607865,39,null,-11,-0.86900000000000011,1.9609999999999999,0.27576224940829175,39,null,null,null,-11,-0.76999999999999991,1.2999999999999998,0.3112173957607865,39,null,null,null,-11,-0.58299999999999996,0.96700000000000008,0.41104184345764255,39]
[null,-10.5,-0.73499999999999999,2.1550000000000002,0.32840305812033305,40,null,-10.5,-0.82950000000000002,2.0005000000000002,0.29099005149902923,40,null,null,null,-10.5,-0.73499999999999999,1.335,0.32840305812033305,40,null,null,null,-10.5,-0.55649999999999999,0.99350000000000005,0.43373988808345848,40]
[null,-10,-0.7,2.1900000000000004,0.34567246359877635,41,null,-10,-0.79,2.04,0.306292056353346,41,null,null,null,-10,-0.7,1.3699999999999999,0.34567246359877624,41,null,null,null,-10,-0.53,1.02,0.45654853682857238,41]
[null,-9.5,-0.66499999999999992,2.2250000000000001,0.3629415092416986,42,null,-9.5,-0.75050000000000006,2.0794999999999999,0.32159374236606197,42,null,null,null,-9.5,-0.66499999999999992,1.4049999999999998,0.3629415092416986,42,null,null,null,-9.5,-0.50350000000000006,1.0465,0.4793567103192245,42]
[null,-9,-0.63,2.2600000000000002,0.38012178556964987,43,null,-9,-0.71100000000000008,2.1189999999999998,0.33681677202374016,43,null,null,null,-9,-0.63,1.44,0.38012178556964987,43,null,null,null,-9,-0.47700000000000004,1.073,0.50204764131840529,43]
[null,-8.5,-0.59499999999999997,2.2949999999999999,0.39712126590142344,44,null,-8.5,-0.67149999999999999,2.1585000000000001,0.35187960269746388,44,null,null,null,-8.5,-0.59499999999999997,1.4749999999999999,0.39712126590142355,44,null,null,null,-8.5,-0.45050000000000001,1.0994999999999999,0.52449978515282347,44]
[null,-8,-0.55999999999999994,2.33,0.4138450753735467,45,null,-8,-0.63200000000000001,2.198,0.36669816805250977,45,null,null,null,-8,-0.55999999999999994,1.5099999999999998,0.4138450753735467,45,null,null,null,-8,-0.42400000000000004,1.1259999999999999,0.54658783539902389,45]
[null,-7.5,-0.52500000000000002,2.3650000000000002,0.43019633164972071,46,null,-7.5,-0.59250000000000003,2.2374999999999998,0.381186622980765,46,null,null,null,-7.5,-0.52500000000000002,1.5449999999999999,0.43019633164972071,46,null,null,null,-7.5,-0.39750000000000002,1.1525000000000001,0.56818383425434804,46]
[null,-7,-0.48999999999999994,2.4000000000000004,0.44607704766680195,47,null,-7,-0.55300000000000005,2.2770000000000001,0.39525814350222949,47,null,null,null,-7,-0.48999999999999994,1.5799999999999998,0.44607704766680184,47,null,null,null,-7,-0.371,1.179,0.5891583648429457,47]
[null,-6.5,-0.45499999999999996,2.4350000000000001,0.46138908523987754,48,null,-6.5,-0.51349999999999996,2.3165,0.40882577173153706,48,null,null,null,-6.5,-0.45499999999999996,1.6149999999999998,0.46138908523987754,48,null,null,null,-6.5,-0.34450000000000003,1.2055,0.60938181069417785,48]
[null,-6,-0.41999999999999993,2.4700000000000002,0.47603514698828525,49,null,-6,-0.47400000000000003,2.3559999999999999,0.42180329479974632,49,null,null,null,-6,-0.41999999999999993,1.65,0.47603514698828525,49,null,null,null,-6,-0.318,1.232,0.62872566583358425,49]
[null,-5.5,-0.38499999999999995,2.5050000000000003,0.48991979288483428,50,null,-5.5,-0.43450000000000005,2.3955000000000002,0.43410614559415683,50,null,null,null,-5.5,-0.38499999999999995,1.6849999999999998,0.48991979288483412,50,null,null,null,-5.5,-0.29149999999999998,1.2585000000000002,0.64706387739506399,50]
[null,-5,-0.35,2.54,0.50295046680614219,51,null,-5,-0.39500000000000002,2.4350000000000001,0.44565231235987285,51,null,null,null,-5,-0.35,1.7199999999999998,0.50295046680614219,51,null,null,null,-5,-0.26500000000000001,1.2850000000000001,0.6642742014420745,51]
[null,-4.5,-0.315,2.5750000000000002,0.51503851780235432,52,null,-4.5,-0.35550000000000004,2.4744999999999999,0.45636324362233921,52,null,null,null,-4.5,-0.315,1.7549999999999999,0.51503851780235432,52,null,null,null,-4.5,-0.23850000000000002,1.3115000000000001,0.68023955181443019,52]
[null,-4,-0.27999999999999997,2.6100000000000003,0.52610020043331918,53,null,-4,-0.316,2.5140000000000002,0.4661647345611688,53,null,null,null,-4,-0.27999999999999997,1.7899999999999998,0.52610020043331907,53,null,null,null,-4,-0.21200000000000002,1.3380000000000001,0.69484932132702526,53]
[null,-3.5,-0.24499999999999997,2.645,0.53605763845276844,54,null,-3.5,-0.27650000000000002,2.5535000000000001,0.47498778090751631,54,null,null,null,-3.5,-0.24499999999999997,1.825,0.53605763845276844,54,null,null,null,-3.5,-0.1855,1.3645,0.70800065456026018,54]
[null,-3,-0.20999999999999996,2.68,0.54483973637217742,55,null,-3,-0.23700000000000002,2.593,0.48276938665889124,55,null,null,null,-3,-0.20999999999999996,1.8599999999999999,0.54483973637217742,55,null,null,null,-3,-0.159,1.391,0.71959965181230956,55]
[null,-2.5,-0.17499999999999999,2.7150000000000003,0.55238302400407036,56,null,-2.5,-0.19750000000000001,2.6325000000000003,0.48945331240866996,56,null,null,null,-2.5,-0.17499999999999999,1.8949999999999998,0.55238302400407036,56,null,null,null,-2.5,-0.13250000000000001,1.4175,0.72956248453367767,56]
[null,-2,-0.13999999999999999,2.75,0.55863241996493707,57,null,-2,-0.158,2.6720000000000002,0.49499075186766572,57,null,null,null,-2,-0.13999999999999999,1.93,0.55863241996493707,57,null,null,null,-2,-0.10600000000000001,1.444,0.73781640372727519,57]
[null,-1.5,-0.10499999999999998,2.7850000000000001,0.56354190129698423,58,null,-1.5,-0.11850000000000001,2.7115,0.49934092519985934,58,null,null,null,-1.5,-0.10499999999999998,1.9649999999999999,0.56354190129698423,58,null,null,null,-1.5,-7.9500000000000001E-2,1.4705000000000001,0.74430062435450739,58]
[null,-1,-6.9999999999999993E-2,2.8200000000000003,0.56707506782430261,59,null,-1,-7.9000000000000001E-2,2.7509999999999999,0.50247157908482498,59,null,null,null,-1,-6.9999999999999993E-2,1.9999999999999998,0.56707506782430261,59,null,null,null,-1,-5.3000000000000005E-2,1.4970000000000001,0.74896707071134294,59]
[null,-0.5,-3.4999999999999996E-2,2.855,0.56920559156394857,60,null,-0.5,-3.95E-2,2.7905000000000002,0.50435938493008103,60,null,null,null,-0.5,-3.4999999999999996E-2,2.0349999999999997,0.56920559156394857,60,null,null,null,-0.5,-2.6500000000000003E-2,1.5235000000000001,0.75178096999012078,60]
[null,0,0,2.89,0.56991754343061818,61,null,0,0,2.83,0.50499022835624385,61,null,null,null,0,0,2.0699999999999998,0.56991754343061818,61,null,null,null,0,0,1.55,0.752721283776288,61]
[null,0.5,3.4999999999999996E-2,2.9250000000000003,0.56920559156394857,62,null,0.5,3.95E-2,2.8694999999999999,0.50435938493008103,62,null,null,null,0.5,3.4999999999999996E-2,2.105,0.56920559156394857,62,null,null,null,0.5,2.6500000000000003E-2,1.5765,0.75178096999012078,62]
[null,1,6.9999999999999993E-2,2.96,0.56707506782430261,63,null,1,7.9000000000000001E-2,2.9090000000000003,0.50247157908482498,63,null,null,null,1,6.9999999999999993E-2,2.1399999999999997,0.56707506782430261,63,null,null,null,1,5.3000000000000005E-2,1.603,0.74896707071134294,63]
[null,1.5,0.10499999999999998,2.9950000000000001,0.56354190129698423,64,null,1.5,0.11850000000000001,2.9485000000000001,0.49934092519985934,64,null,null,null,1.5,0.10499999999999998,2.1749999999999998,0.56354190129698423,64,null,null,null,1.5,7.9500000000000001E-2,1.6294999999999999,0.74430062435450739,64]
[null,2,{"$f":"B219*$C$115/10","v":0.13999999999999999},{"$f":"C219+$B$115","v":3.0300000000000002},{"$f":"NORMDIST(D219,$B$115,$C$115,FALSE)","v":0.55863241996493707},65,null,2,{"$f":"H219*$C$116/10","v":0.158},{"$f":"I219+$B$116","v":2.988},{"$f":"NORMDIST(J219,$B$116,$C$116,FALSE)","v":0.49499075186766572},65,null,null,null,2,{"$f":"P219*$C$117/10","v":0.13999999999999999},{"$f":"Q219+$B$117","v":2.21},{"$f":"NORMDIST(R219,$B$117,$C$117,FALSE)","v":0.55863241996493707},65,null,null,null,2,{"$f":"X219*$C$118/10","v":0.10600000000000001},{"$f":"Y219+$B$118","v":1.6560000000000001},{"$f":"NORMDIST(Z219,$B$118,$C$118,FALSE)","v":0.73781640372727519},65]
[null,2.5,0.17499999999999999,3.0649999999999999,0.55238302400407036,66,null,2.5,0.19750000000000001,3.0274999999999999,0.48945331240866996,66,null,null,null,2.5,0.17499999999999999,2.2449999999999997,0.55238302400407036,66,null,null,null,2.5,0.13250000000000001,1.6825000000000001,0.72956248453367767,66]
[null,{"$f":"B220+0.5","v":3},0.20999999999999996,3.1,0.54483973637217742,67,null,{"$f":"H220+0.5","v":3},0.23700000000000002,3.0670000000000002,0.48276938665889124,67,null,null,null,{"$f":"P220+0.5","v":3},0.20999999999999996,2.2799999999999998,0.54483973637217742,67,null,null,null,{"$f":"X220+0.5","v":3},0.159,1.7090000000000001,0.71959965181230956,67]
[null,{"$f":"B221+0.5","v":3.5},0.24499999999999997,3.1350000000000002,0.53605763845276844,68,null,{"$f":"H221+0.5","v":3.5},0.27650000000000002,3.1065,0.47498778090751631,68,null,null,null,{"$f":"P221+0.5","v":3.5},0.24499999999999997,2.3149999999999999,0.53605763845276844,68,null,null,null,{"$f":"X221+0.5","v":3.5},0.1855,1.7355,0.70800065456026018,68]
[null,{"$f":"B222+0.5","v":4},0.27999999999999997,3.17,0.52610020043331918,69,null,{"$f":"H222+0.5","v":4},0.316,3.1459999999999999,0.4661647345611688,69,null,null,null,{"$f":"P222+0.5","v":4},0.27999999999999997,2.3499999999999996,0.52610020043331918,69,null,null,null,{"$f":"X222+0.5","v":4},0.21200000000000002,1.762,0.69484932132702526,69]
[null,{"$f":"B223+0.5","v":4.5},0.315,3.2050000000000001,0.51503851780235432,70,null,{"$f":"H223+0.5","v":4.5},0.35550000000000004,3.1855000000000002,0.45636324362233921,70,null,null,null,{"$f":"P223+0.5","v":4.5},0.315,2.3849999999999998,0.51503851780235432,70,null,null,null,{"$f":"X223+0.5","v":4.5},0.23850000000000002,1.7885,0.68023955181443019,70]
[null,5,0.35,3.24,0.50295046680614219,71,null,5,0.39500000000000002,3.2250000000000001,0.44565231235987285,71,null,null,null,5,0.35,2.42,0.50295046680614219,71,null,null,null,5,0.26500000000000001,1.8149999999999999,0.6642742014420745,71]
[null,5.5,0.38499999999999995,3.2749999999999999,0.48991979288483428,72,null,5.5,0.43450000000000005,3.2645,0.43410614559415683,72,null,null,null,5.5,0.38499999999999995,2.4549999999999996,0.48991979288483428,72,null,null,null,5.5,0.29149999999999998,1.8414999999999999,0.64706387739506399,72]
[null,6,0.41999999999999993,3.31,0.47603514698828525,73,null,6,0.47400000000000003,3.3040000000000003,0.42180329479974632,73,null,null,null,6,0.41999999999999993,2.4899999999999998,0.47603514698828525,73,null,null,null,6,0.318,1.8680000000000001,0.62872566583358425,73]
[null,6.5,0.45499999999999996,3.3450000000000002,0.46138908523987754,74,null,6.5,0.51349999999999996,3.3435000000000001,0.40882577173153706,74,null,null,null,6.5,0.45499999999999996,2.5249999999999999,0.46138908523987754,74,null,null,null,6.5,0.34450000000000003,1.8945000000000001,0.60938181069417785,74]
[null,7,0.48999999999999994,3.38,0.44607704766680195,75,null,7,0.55300000000000005,3.383,0.39525814350222949,75,null,null,null,7,0.48999999999999994,2.5599999999999996,0.44607704766680195,75,null,null,null,7,0.371,1.921,0.5891583648429457,75]
[null,7.5,0.52500000000000002,3.415,0.43019633164972071,76,null,7.5,0.59250000000000003,3.4225000000000003,0.381186622980765,76,null,null,null,7.5,0.52500000000000002,2.5949999999999998,0.43019633164972071,76,null,null,null,7.5,0.39750000000000002,1.9475,0.56818383425434804,76]
[null,8,0.55999999999999994,3.45,0.4138450753735467,77,null,8,0.63200000000000001,3.4620000000000002,0.36669816805250977,77,null,null,null,8,0.55999999999999994,2.63,0.4138450753735467,77,null,null,null,8,0.42400000000000004,1.9740000000000002,0.54658783539902389,77]
[null,8.5,0.59499999999999997,3.4850000000000003,0.39712126590142344,78,null,8.5,0.67149999999999999,3.5015000000000001,0.35187960269746388,78,null,null,null,8.5,0.59499999999999997,2.665,0.39712126590142344,78,null,null,null,8.5,0.45050000000000001,2.0005000000000002,0.52449978515282347,78]
[null,9,0.63,3.52,0.38012178556964987,79,null,9,0.71100000000000008,3.5410000000000004,0.33681677202374016,79,null,null,null,9,0.63,2.6999999999999997,0.38012178556964987,79,null,null,null,9,0.47700000000000004,2.0270000000000001,0.50204764131840529,79]
[null,9.5,0.66499999999999992,3.5550000000000002,0.3629415092416986,80,null,9.5,0.75050000000000006,3.5805000000000002,0.32159374236606197,80,null,null,null,9.5,0.66499999999999992,2.7349999999999999,0.3629415092416986,80,null,null,null,9.5,0.50350000000000006,2.0535000000000001,0.4793567103192245,80]
[null,10,0.7,3.59,0.34567246359877635,81,null,10,0.79,3.62,0.306292056353346,81,null,null,null,10,0.7,2.7699999999999996,0.34567246359877635,81,null,null,null,10,0.53,2.08,0.45654853682857238,81]
[null,10.5,0.73499999999999999,3.625,0.32840305812033305,82,null,10.5,0.82950000000000002,3.6595,0.29099005149902923,82,null,null,null,10.5,0.73499999999999999,2.8049999999999997,0.32840305812033305,82,null,null,null,10.5,0.55649999999999999,2.1065,0.43373988808345848,82]
[null,11,0.76999999999999991,3.66,0.3112173957607865,83,null,11,0.86900000000000011,3.6990000000000003,0.27576224940829175,83,null,null,null,11,0.76999999999999991,2.84,0.3112173957607865,83,null,null,null,11,0.58299999999999996,2.133,0.41104184345764255,83]
[null,11.5,0.80499999999999994,3.6950000000000003,0.29419466959996382,84,null,11.5,0.90850000000000009,3.7385000000000002,0.26067882116452495,84,null,null,null,11.5,0.80499999999999994,2.875,0.29419466959996382,84,null,null,null,11.5,0.60950000000000004,2.1595,0.38855899758485807,84]
[null,{"$f":"B238+0.5","v":12},0.83999999999999986,3.73,0.27740864997601855,85,null,{"$f":"H238+0.5","v":12},0.94800000000000006,3.778,0.245805132890143,85,null,null,null,{"$f":"P238+0.5","v":12},0.83999999999999986,2.9099999999999997,0.27740864997601855,85,null,null,null,{"$f":"X238+0.5","v":12},0.63600000000000001,2.1859999999999999,0.36638878298719441,85]
[null,{"$f":"B239+0.5","v":12.5},0.875,3.7650000000000001,0.26092726484145989,86,null,{"$f":"H239+0.5","v":12.5},0.98750000000000004,3.8174999999999999,0.23120137391015436,86,null,null,null,{"$f":"P239+0.5","v":12.5},0.875,2.9449999999999998,0.26092726484145989,86,null,null,null,{"$f":"X239+0.5","v":12.5},0.66249999999999998,2.2124999999999999,0.34462091582834331,86]
[null,13,0.90999999999999992,3.8,0.24481227435401068,87,null,13,1.0269999999999999,3.8570000000000002,0.21692226841494602,87,null,null,null,13,0.90999999999999992,2.9799999999999995,0.24481227435401068,87,null,null,null,13,0.68900000000000006,2.2389999999999999,0.32333696612793855,87]
[null,13.5,0.94499999999999995,3.835,0.22911903905988518,88,null,13.5,1.0665,3.8965000000000001,0.20301687005306282,88,null,null,null,13.5,0.94499999999999995,3.0149999999999997,0.22911903905988518,88,null,null,null,13.5,0.71550000000000002,2.2655000000000003,0.30261005158852738,88]
[null,14,0.97999999999999987,3.87,0.21389637947963547,89,null,14,1.1060000000000001,3.9359999999999999,0.18952843751360118,89,null,null,null,14,0.97999999999999987,3.05,0.21389637947963547,89,null,null,null,14,0.74199999999999999,2.2919999999999998,0.28250465214291504,89]
[null,14.5,1.0149999999999999,3.9050000000000002,0.19918652349337176,90,null,14.5,1.1455,3.9755000000000003,0.17649438790551927,90,null,null,null,14.5,1.0149999999999999,3.085,0.19918652349337176,90,null,null,null,14.5,0.76850000000000007,2.3185000000000002,0.26307654046294382,90]
[null,15,1.05,3.9400000000000004,0.18502513666555953,91,null,15,1.1850000000000001,4.0150000000000006,0.16394632362771092,91,null,null,null,15,1.05,3.12,0.18502513666555953,91,null,null,null,15,0.79500000000000004,2.3450000000000002,0.24437282201111632,91]
[null,15.5,1.085,3.9750000000000001,0.17144142956712227,92,null,15.5,1.2245000000000001,4.0545,0.15191012746453877,92,null,null,null,15.5,1.085,3.1549999999999998,0.17144142956712227,92,null,null,null,15.5,0.82150000000000001,2.3715000000000002,0.22643207678676525,92]
[null,16,1.1199999999999999,4.01,0.15845833525636521,93,null,16,1.264,4.0940000000000003,0.14040611984741205,93,null,null,null,16,1.1199999999999999,3.1899999999999995,0.15845833525636521,93,null,null,null,16,0.84800000000000009,2.3980000000000001,0.20928459373482178,93]
[null,16.5,1.1549999999999998,4.0449999999999999,0.14609274937711147,94,null,16.5,1.3035000000000001,4.1334999999999997,0.12944927159997227,94,null,null,null,16.5,1.1549999999999998,3.2249999999999996,0.14609274937711147,94,null,null,null,16.5,0.87450000000000006,2.4245000000000001,0.1929526878565623,94]
[null,17,1.19,4.08,0.13435582482412423,95,null,17,1.343,4.173,0.1190494650340341,95,null,null,null,17,1.19,3.26,0.13435582482412423,95,null,null,null,17,0.90100000000000002,2.4510000000000001,0.17745108939035273,95]
[null,17.5,1.2250000000000001,4.1150000000000002,0.12325331260930211,96,null,17.5,1.3825000000000001,4.2125000000000004,0.10921179598292592,96,null,null,null,17.5,1.2250000000000001,3.2949999999999999,0.12325331260930211,96,null,null,null,17.5,0.92749999999999999,2.4775,0.1627873940122859,96]
[null,18,{"$f":"B251*$C$115/10","v":1.26},{"$f":"C251+$B$115","v":4.1500000000000004},{"$f":"NORMDIST(D251,$B$115,$C$115,FALSE)","v":0.1127859404298487},97,null,18,{"$f":"H251*$C$116/10","v":1.4220000000000002},{"$f":"I251+$B$116","v":4.2520000000000007},{"$f":"NORMDIST(J251,$B$116,$C$116,FALSE)","v":9.9936909241638047E-2},97,null,null,null,18,{"$f":"P251*$C$117/10","v":1.26},{"$f":"Q251+$B$117","v":3.33},{"$f":"NORMDIST(R251,$B$117,$C$117,FALSE)","v":0.1127859404298487},97,null,null,null,18,{"$f":"X251*$C$118/10","v":0.95400000000000007},{"$f":"Y251+$B$118","v":2.504},{"$f":"NORMDIST(Z251,$B$118,$C$118,FALSE)","v":0.14896256283187581},97]
[null,18.5,1.2949999999999999,4.1850000000000005,0.10294982048031129,98,null,18.5,1.4615,4.2915000000000001,9.1221359919263306E-2,98,null,null,null,18.5,1.2949999999999999,3.3649999999999998,0.10294982048031141,98,null,null,null,18.5,0.98049999999999993,2.5305,0.1359714610117321,98]
[null,19,1.3299999999999998,4.22,9.3736878249538053E-2,99,null,19,1.5010000000000001,4.3310000000000004,8.3057993385666509E-2,99,null,null,null,19,1.3299999999999998,3.3999999999999995,9.3736878249538053E-2,99,null,null,null,19,1.0070000000000001,2.5570000000000004,0.12380342410316325,99]
[null,19.5,1.3649999999999998,4.2549999999999999,8.5135294384023022E-2,100,null,19.5,1.5405000000000002,4.3704999999999998,7.5436336795969783E-2,100,null,null,null,19.5,1.3649999999999998,3.4349999999999996,8.5135294384023022E-2,100,null,null,null,19.5,1.0335000000000001,2.5834999999999999,0.11244284163927568,100]
[null,20,1.4,4.29,7.7129952161697241E-2,101,null,20,1.58,4.41,6.8342995586313987E-2,101,null,null,null,20,1.4,3.4699999999999998,7.7129952161697241E-2,101,null,null,null,20,1.06,2.6100000000000003,0.10186974813809056,101]
[null,20.5,1.4350000000000001,4.3250000000000002,6.9702883684546746E-2,102,null,20.5,1.6194999999999999,4.4495000000000005,6.1762048834408508E-2,102,null,null,null,20.5,1.4350000000000001,3.5049999999999999,6.9702883684546746E-2,102,null,null,null,20.5,1.0865,2.6364999999999998,9.2060412413552506E-2,102]
[null,21,1.47,4.3600000000000003,6.2833708543467356E-2,103,null,21,1.659,4.4889999999999999,5.567543794990789E-2,103,null,null,null,21,1.47,3.54,6.2833708543467356E-2,103,null,null,null,21,1.113,2.6630000000000003,8.2987916944202239E-2,103]
[null,21.5,1.5049999999999999,4.3949999999999996,5.6500059413386088E-2,104,null,21.5,1.6984999999999999,4.5285000000000002,5.0063343784012934E-2,104,null,null,null,21.5,1.5049999999999999,3.5749999999999997,5.6500059413386032E-2,104,null,null,null,21.5,1.1395000000000002,2.6895000000000002,7.4622719979943755E-2,104]
[null,22,1.5399999999999998,4.43,5.0677989780330661E-2,105,null,22,1.7380000000000002,4.5680000000000005,4.490454790662201E-2,105,null,null,null,22,1.5399999999999998,3.6099999999999994,5.0677989780330661E-2,105,null,null,null,22,1.1659999999999999,2.7160000000000002,6.6933194049493258E-2,105]
[null,22.5,1.5749999999999997,4.4649999999999999,4.5342359765239211E-2,106,null,22.5,1.7775000000000003,4.6074999999999999,4.0176774475528414E-2,106,null,null,null,22.5,1.5749999999999997,3.6449999999999996,4.5342359765239211E-2,106,null,null,null,22.5,1.1925000000000001,2.7425000000000002,5.9886135538995126E-2,106]
[null,23,1.6099999999999999,4.5,4.0467196773715984E-2,107,null,23,1.8170000000000002,4.6470000000000002,3.5857009799495139E-2,107,null,null,null,23,1.6099999999999999,3.6799999999999997,4.0467196773715984E-2,107,null,null,null,23,1.2190000000000001,2.7690000000000001,5.3447241021889032E-2,107]
[null,23.5,1.645,4.5350000000000001,3.6026028450277692E-2,108,null,23.5,1.8565,4.6865000000000006,3.1921797361005519E-2,108,null,null,null,23.5,1.645,3.7149999999999999,3.6026028450277692E-2,108,null,null,null,23.5,1.2455000000000001,2.7955000000000001,4.7581547009800718E-2,108]
[null,24,1.6799999999999997,4.57,3.1992186135489833E-2,109,null,24,1.8960000000000001,4.726,2.8347506702332787E-2,109,null,null,null,24,1.6799999999999997,3.7499999999999996,3.1992186135489861E-2,109,null,null,null,24,1.272,2.8220000000000001,4.2253830744986599E-2,109]
[null,24.5,1.7149999999999999,4.6050000000000004,2.8339077702564705E-2,110,null,24.5,1.9355,4.7655000000000003,2.5110575179487733E-2,110,null,null,null,24.5,1.7149999999999999,3.7849999999999997,2.8339077702564771E-2,110,null,null,null,24.5,1.2985000000000002,2.8485000000000005,3.7428970550557154E-2,110]
[null,25,1.75,4.6400000000000006,2.504042927652643E-2,111,null,25,1.9750000000000001,4.8049999999999997,2.2187722143757662E-2,111,null,null,null,25,1.75,3.82,2.5040429276526485E-2,111,null,null,null,25,1.325,2.875,3.3072265082204788E-2,111]
[null,25.5,1.7849999999999997,4.6749999999999998,2.2070495906278822E-2,112,null,25.5,2.0145,4.8445,1.9556135613158446E-2,112,null,null,null,25.5,1.7849999999999997,3.8549999999999995,2.2070495906278822E-2,112,null,null,null,25.5,1.3515000000000001,2.9015000000000004,2.9149711574330453E-2,112]
[null,26,1.8199999999999998,4.71,1.9404241762408021E-2,113,null,26,2.0539999999999998,4.8840000000000003,1.7193631941374191E-2,113,null,null,null,26,1.8199999999999998,3.8899999999999997,1.9404241762408021E-2,113,null,null,null,26,1.3780000000000001,2.9279999999999999,2.5628243837142704E-2,113]
[null,26.5,1.8549999999999998,4.7450000000000001,1.7017490868007384E-2,114,null,26.5,2.0935000000000001,4.9235000000000007,1.5078789376715382E-2,114,null,null,null,26.5,1.8549999999999998,3.9249999999999998,1.7017490868007384E-2,114,null,null,null,26.5,1.4045000000000001,2.9545000000000003,2.2475931335104091E-2,114]
[null,27,1.89,4.78,1.4887049734889416E-2,115,null,27,2.133,4.9630000000000001,1.319105672711722E-2,115,null,null,null,27,1.89,3.96,1.4887049734889416E-2,115,null,null,null,27,1.431,2.9809999999999999,1.9662141159287931E-2,115]
[null,27.5,1.925,4.8150000000000004,1.2990803573701488E-2,116,null,27.5,2.1725000000000003,5.0025000000000004,1.1510838609608913E-2,116,null,null,null,27.5,1.925,3.9950000000000001,1.2990803573701488E-2,116,null,null,null,27.5,1.4575,3.0075000000000003,1.7157665097341589E-2,116]
[null,28,1.9599999999999997,4.8499999999999996,1.1307787975685683E-2,117,null,28,2.2120000000000002,5.0419999999999998,1.001955896579744E-2,117,null,null,null,28,1.9599999999999997,4.0299999999999994,1.1307787975685683E-2,117,null,null,null,28,1.484,3.0339999999999998,1.4934814307509392E-2,117]
[null,28.5,1.9949999999999999,4.8849999999999998,9.8182381294485404E-3,118,null,28.5,2.2515000000000001,5.0815000000000001,8.6997046716632536E-3,118,null,null,null,28.5,1.9949999999999999,4.0649999999999995,9.8182381294485404E-3,118,null,null,null,28.5,1.5105,3.0605000000000002,1.296748432191315E-2,118]
[null,29,2.0299999999999998,4.92,8.5036177425369345E-3,119,null,29,2.2909999999999999,5.1210000000000004,7.5348511642732256E-3,119,null,null,null,29,2.0299999999999998,4.0999999999999996,8.5036177425369345E-3,119,null,null,null,29,1.5370000000000001,3.0870000000000002,1.12311932448601E-2,119]
[null,29.5,2.0649999999999999,4.9550000000000001,7.3466298900770567E-3,120,null,29.5,2.3304999999999998,5.1604999999999999,6.5096720544986619E-3,120,null,null,null,29.5,2.0649999999999999,4.1349999999999998,7.3466298900770567E-3,120,null,null,null,29.5,1.5635000000000001,3.1135000000000002,9.7030960812338456E-3,120]
[null,30,2.1,4.99,6.3312120170542852E-3,121,null,30,2.37,5.2,5.6099346986557049E-3,121,null,null,null,30,2.1,4.17,6.3312120170542852E-3,121,null,null,null,30,1.59,3.14,8.3619781357320896E-3,121]
[]
[]
[]
[]
[]
[null,"Marque ","x","y",null,null,null,"Marque ","x","y",null,null,null,null,null,"Marque ","x","y",null,null,null,null,null,"Marque ","x","y"]
[null,"T1",{"$f":"VLOOKUP($B$32,D155:G275,3,TRUE)","v":46},{"$f":"VLOOKUP($B$32,D155:E275,2,TRUE)","v":0.43019633164972071},null,null,null,"T1",{"$f":"VLOOKUP($B$33,J155:M275,3,TRUE)","v":52},{"$f":"VLOOKUP($B$33,J155:K275,2,TRUE)","v":0.45636324362233921},null,null,null,null,null,"T1",{"$f":"VLOOKUP($B$34,R155:U275,3,TRUE)","v":64},{"$f":"VLOOKUP($B$34,R155:S275,2,TRUE)","v":0.56354190129698423},null,null,null,null,null,"T1",{"$f":"VLOOKUP($B$35,Z155:AC275,3,TRUE)","v":55},{"$f":"VLOOKUP($B$35,Z155:AA275,2,TRUE)","v":0.71959965181230956}]
[null,"T2",{"$f":"VLOOKUP($E$32,D155:G275,3,TRUE)","v":52},{"$f":"VLOOKUP($E$32,D155:E275,2,TRUE)","v":0.51503851780235432},null,null,null,"T2",{"$f":"VLOOKUP($E$33,J155:M275,3,TRUE)","v":44},{"$f":"VLOOKUP($E$33,J155:K275,2,TRUE)","v":0.35187960269746388},null,null,null,null,null,"T2",{"$f":"VLOOKUP($E$34,R155:U275,3,TRUE)","v":47},{"$f":"VLOOKUP($E$34,R155:S275,2,TRUE)","v":0.44607704766680184},null,null,null,null,null,"T2",{"$f":"VLOOKUP($E$35,Z155:AC275,3,TRUE)","v":47},{"$f":"VLOOKUP($E$35,Z155:AA275,2,TRUE)","v":0.5891583648429457}]
[]
[null,"Moyenne norme","x","y",null,null,null,"Moyenne norme","x","y",null,null,null,null,null,"Moyenne norme","x","y",null,null,null,null,null,"Moyenne norme","x","y"]
[]
[]
[null,"Ecart sup","x","y",null,null,null,"Ecart sup","x","y",null,null,null,null,null,"Ecart sup","x","y",null,null,null,null,null,"Ecart sup","x","y"]
[null,null,71,0,null,null,null,null,71,0,null,null,null,null,null,null,71,0,null,null,null,null,null,null,71,0]
[null,null,71,{"$f":"VLOOKUP(5,B155:F275,4,TRUE)","v":0.50295046680614219},null,null,null,null,71,{"$f":"VLOOKUP(5,H155:L275,4,TRUE)","v":0.44565231235987285},null,null,null,null,null,null,71,{"$f":"VLOOKUP(5,P155:T275,4,TRUE)","v":0.50295046680614219},null,null,null,null,null,null,71,{"$f":"VLOOKUP(5,X155:AB275,4,TRUE)","v":0.6642742014420745}]
[null,"Ecart inf","x","y",null,null,null,"Ecart inf","x","y",null,null,null,null,null,"Ecart inf","x","y",null,null,null,null,null,"Ecart inf","x","y"]
[null,null,51,0,null,null,null,null,51,0,null,null,null,null,null,null,51,0,null,null,null,null,null,null,51,0]
[null,null,51,{"$f":"VLOOKUP(-5,B155:F275,4,TRUE)","v":0.50295046680614219},null,null,null,null,51,{"$f":"VLOOKUP(-5,H155:L275,4,TRUE)","v":0.44565231235987285},null,null,null,null,null,null,51,{"$f":"VLOOKUP(-5,P155:T275,4,TRUE)","v":0.50295046680614219},null,null,null,null,null,null,51,{"$f":"VLOOKUP(-5,X155:AB275,4,TRUE)","v":0.6642742014420745}]
[null,"Ecart 2 sup","x","y",null,null,null,"Ecart 2 sup","x","y",null,null,null,null,null,"Ecart 2 sup","x","y",null,null,null,null,null,"Ecart 2 sup","x","y"]
[null,null,91,0,null,null,null,null,91,0,null,null,null,null,null,null,91,0,null,null,null,null,null,null,91,0]
[null,null,91,{"$f":"VLOOKUP(15,B155:F275,4,TRUE)","v":0.18502513666555953},null,null,null,null,91,{"$f":"VLOOKUP(15,H155:L275,4,TRUE)","v":0.16394632362771092},null,null,null,null,null,null,91,{"$f":"VLOOKUP(15,P155:T275,4,TRUE)","v":0.18502513666555953},null,null,null,null,null,null,91,{"$f":"VLOOKUP(15,X155:AB275,4,TRUE)","v":0.24437282201111632}]
[null,"Ecart 2 inf","x","y",null,null,null,"Ecart 2 inf","x","y",null,null,null,null,null,"Ecart 2 inf","x","y",null,null,null,null,null,"Ecart 2 inf","x","y"]
[null,null,31,0,null,null,null,null,31,0,null,null,null,null,null,null,31,0,null,null,null,null,null,null,31,0]
[null,null,31,{"$f":"VLOOKUP(-15,B155:G275,4,TRUE)","v":0.18502513666555956},null,null,null,null,31,{"$f":"VLOOKUP(-15,H155:M275,4,TRUE)","v":0.16394632362771105},null,null,null,null,null,null,31,{"$f":"VLOOKUP(-15,P155:U275,4,TRUE)","v":0.18502513666555956},null,null,null,null,null,null,31,{"$f":"VLOOKUP(-15,X155:AC275,4,TRUE)","v":0.24437282201111646}]

{"sheet":"MEAQ","index":6,"n_rows":424,"n_cols":45,"rows_kept":424,"cut":false,"hidden":false,"merged":[[26,9,26,11],[27,9,27,11],[28,9,28,11],[29,9,29,11],[30,9,30,11],[21,9,21,11],[22,9,22,11],[23,9,23,11],[24,9,24,11],[25,9,25,11],[36,9,36,11],[37,9,37,11],[38,9,38,11],[39,9,39,11],[40,9,40,11],[31,9,31,11],[32,9,32,11],[33,9,33,11],[34,9,34,11],[35,9,35,11],[46,9,46,11],[47,9,47,11],[48,9,48,11],[49,9,49,11],[50,9,50,11],[41,9,41,11],[42,9,42,11],[43,9,43,11],[44,9,44,11],[45,9,45,11],[56,9,56,11],[57,9,57,11],[58,9,58,11],[59,9,59,11],[60,9,60,11],[51,9,51,11],[52,9,52,11],[53,9,53,11],[54,9,54,11],[55,9,55,11],[70,1,70,3],[70,4,70,6],[66,0,66,6],[67,0,67,6],[68,0,68,6],[66,9,66,11],[67,9,67,11],[68,9,68,11],[61,9,61,11],[62,9,62,11],[63,9,63,11],[64,9,64,11],[65,9,65,11],[70,11,70,12],[65,0,65,6],[11,0,11,6],[12,0,12,6],[13,0,13,6],[14,0,14,6],[15,0,15,6],[6,0,6,6],[7,0,7,6],[8,0,8,6],[9,0,9,6],[10,0,10,6],[21,0,21,6],[22,0,22,6],[23,0,23,6],[24,0,24,6],[25,0,25,6],[16,0,16,6],[17,0,17,6],[18,0,18,6],[19,0,19,6],[20,0,20,6],[31,0,31,6],[32,0,32,6],[33,0,33,6],[34,0,34,6],[35,0,35,6],[26,0,26,6],[27,0,27,6],[28,0,28,6],[29,0,29,6],[30,0,30,6],[56,0,56,6],[57,0,57,6],[58,0,58,6],[59,0,59,6],[60,0,60,6],[51,0,51,6],[52,0,52,6],[53,0,53,6],[54,0,54,6],[55,0,55,6],[6,9,6,11],[7,9,7,11],[8,9,8,11],[9,9,9,11],[10,9,10,11],[61,0,61,6],[62,0,62,6],[63,0,63,6],[64,0,64,6],[46,0,46,6],[47,0,47,6],[48,0,48,6],[49,0,49,6],[50,0,50,6],[41,0,41,6],[42,0,42,6],[43,0,43,6],[44,0,44,6],[45,0,45,6],[36,0,36,6],[37,0,37,6],[38,0,38,6],[39,0,39,6],[40,0,40,6],[16,9,16,11],[17,9,17,11],[18,9,18,11],[19,9,19,11],[20,9,20,11],[11,9,11,11],[12,9,12,11],[13,9,13,11],[14,9,14,11],[15,9,15,11]]}
["Multidimensional Experiential Avoidance Questionnaire"]
[]
[null,1,2,3,4,5,6]
[null,"Strongly disagree ","Moderately  disagree ","Slightly disagree ","Slightly agree ","Moderatly agree ","Strongly agree "]
[]
[]
["Item",null,null,null,null,null,null,"Score T1 R","Score T2","Dimension"]
["1-I won’t do something if I think it will make me uncomfortable.",null,null,null,null,null,null,{"$f":"'Quest T1'!N76","v":6},{"$f":"'Quest T2'!N61","v":2},"Behavioral avoidance"]
["2-If I could magically remove all of my painful memories, I would. ",null,null,null,null,null,null,{"$f":"'Quest T1'!N77","v":6},{"$f":"'Quest T2'!N62","v":5},"Distress aversion"]
["3-When something upsetting comes up, I try very hard to stop thinking about it. ",null,null,null,null,null,null,{"$f":"'Quest T1'!N78","v":1},{"$f":"'Quest T2'!N63","v":1},"Distraction suppression"]
["4-I sometimes have difficulty identifying how I feel.",null,null,null,null,null,null,{"$f":"'Quest T1'!N79","v":4},{"$f":"'Quest T2'!N64","v":2},"Repression and denial"]
["5-I tend to put off unpleasant things that need to get done. ",null,null,null,null,null,null,{"$f":"'Quest T1'!N80","v":2},{"$f":"'Quest T2'!N65","v":1},"Procrastination"]
["6-People should face their fears.",null,null,null,null,null,null,{"$f":"'Quest T1'!N81","v":4},{"$f":"'Quest T2'!N66","v":5},"Distress endurance"]
["7-Happiness means never feeling any pain or disappointment. ",null,null,null,null,null,null,{"$f":"'Quest T1'!N82","v":1},{"$f":"'Quest T2'!N67","v":1},"Distress aversion"]
["8-I avoid activities if there is even a small possibility of getting hurt.",null,null,null,null,null,null,{"$f":"'Quest T1'!N83","v":2},{"$f":"'Quest T2'!N68","v":2},"Behavioral avoidance"]
["9-When negative thoughts come up, I try to fill my head with something else.",null,null,null,null,null,null,{"$f":"'Quest T1'!N84","v":4},{"$f":"'Quest T2'!N69","v":2},"Distraction suppression"]
["10-At times, people have told me I’m in denial.",null,null,null,null,null,null,{"$f":"'Quest T1'!N85","v":1},{"$f":"'Quest T2'!N70","v":1},"Repression and denial"]
["11-I sometimes procrastinate to avoid facing challenges.",null,null,null,null,null,null,{"$f":"'Quest T1'!N86","v":2},{"$f":"'Quest T2'!N71","v":2},"Procrastination"]
["12-Even when I feel uncomfortable, I don’t give up working toward things I value. ",null,null,null,null,null,null,{"$f":"'Quest T1'!N87","v":5},{"$f":"'Quest T2'!N72","v":5},"Distress endurance"]
["13-When I am hurting, I would do anything to feel better.",null,null,null,null,null,null,{"$f":"'Quest T1'!N88","v":2},{"$f":"'Quest T2'!N73","v":4},"Distress aversion"]
["14-I rarely do something if there is a chance that it will upset me. ",null,null,null,null,null,null,{"$f":"'Quest T1'!N89","v":2},{"$f":"'Quest T2'!N74","v":3},"Behavioral avoidance"]
["15-I usually try to distract myself when I feel something painful. ",null,null,null,null,null,null,{"$f":"'Quest T1'!N90","v":2},{"$f":"'Quest T2'!N75","v":2},"Distraction suppression"]
["16-I am able to « turn off » my emotions when I don’t want to feel.  ",null,null,null,null,null,null,{"$f":"'Quest T1'!N91","v":1},{"$f":"'Quest T2'!N76","v":1},"Repression and denial"]
["17-When I have something important to do I find myself doing a lot of other things instead. ",null,null,null,null,null,null,{"$f":"'Quest T1'!N92","v":2},{"$f":"'Quest T2'!N77","v":2},"Procrastination"]
["18-I am willing to put up with pain and discomfort to get what I want. ",null,null,null,null,null,null,{"$f":"'Quest T1'!N93","v":5},{"$f":"'Quest T2'!N78","v":3},"Distress endurance"]
["19-Happiness involves getting rid of negative thoughts. ",null,null,null,null,null,null,{"$f":"'Quest T1'!N94","v":4},{"$f":"'Quest T2'!N79","v":4},"Distress aversion"]
["20-I work hard to avoid situations that might bring up unpleasant thoughts and feelings in me. ",null,null,null,null,null,null,{"$f":"'Quest T1'!N95","v":6},{"$f":"'Quest T2'!N80","v":3},"Behavioral avoidance"]
["21-I don’t realize I’m anxious until other people tell me. ",null,null,null,null,null,null,{"$f":"'Quest T1'!N96","v":1},{"$f":"'Quest T2'!N81","v":1},"Repression and denial"]
["22-When upsetting memories come up, I try to focus on other things.",null,null,null,null,null,null,{"$f":"'Quest T1'!N97","v":4},{"$f":"'Quest T2'!N82","v":2},"Distraction suppression"]
["23-I am in touch with my emotions.",null,null,null,null,null,null,{"$f":"'Quest T1'!N98","v":4},{"$f":"'Quest T2'!N83","v":2},"Repression and denial"]
["24-I am willing to suffer for the things that matter to me. ",null,null,null,null,null,null,{"$f":"'Quest T1'!N99","v":6},{"$f":"'Quest T2'!N84","v":4},"Distress endurance"]
["25-One of my big goals is to be free from painful emotions. ",null,null,null,null,null,null,{"$f":"'Quest T1'!N100","v":2},{"$f":"'Quest T2'!N85","v":1},"Distress aversion"]
["26-I prefer to stick to what I am comfortable with, rather than try new activities. ",null,null,null,null,null,null,{"$f":"'Quest T1'!N101","v":3},{"$f":"'Quest T2'!N86","v":1},"Behavioral avoidance"]
["27-I work hard to keep out upsetting feelings.",null,null,null,null,null,null,{"$f":"'Quest T1'!N102","v":4},{"$f":"'Quest T2'!N87","v":3},"Distraction suppression"]
["28-People have said that I don’t own up to my problems.",null,null,null,null,null,null,{"$f":"'Quest T1'!N103","v":2},{"$f":"'Quest T2'!N88","v":1},"Repression and denial"]
["29-Fear or anxiety won’t stop me from doing something important. ",null,null,null,null,null,null,{"$f":"'Quest T1'!N104","v":1},{"$f":"'Quest T2'!N89","v":1},"Distress endurance"]
["30-I try to deal with problems right away. ",null,null,null,null,null,null,{"$f":"'Quest T1'!N105","v":5},{"$f":"'Quest T2'!N90","v":4},"Procrastination"]
["31-I’d do anything to feel less stressed. ",null,null,null,null,null,null,{"$f":"'Quest T1'!N106","v":6},{"$f":"'Quest T2'!N91","v":5},"Distress aversion"]
["32-If I have any doubts about doing something, I just won’t do it. ",null,null,null,null,null,null,{"$f":"'Quest T1'!N107","v":2},{"$f":"'Quest T2'!N92","v":2},"Behavioral avoidance"]
["33-When unpleasant memories come to me, I try to put them out of my mind.",null,null,null,null,null,null,{"$f":"'Quest T1'!N108","v":3},{"$f":"'Quest T2'!N93","v":2},"Distraction suppression"]
["34-In this day and age people should not have to suffer. ",null,null,null,null,null,null,{"$f":"'Quest T1'!N109","v":1},{"$f":"'Quest T2'!N94","v":2},"Distress aversion"]
["35-Others have told me that I suppress my feelings.",null,null,null,null,null,null,{"$f":"'Quest T1'!N110","v":1},{"$f":"'Quest T2'!N95","v":1},"Repression and denial"]
["36-I try to put off unpleasant tasks for as long as possible. ",null,null,null,null,null,null,{"$f":"'Quest T1'!N111","v":2},{"$f":"'Quest T2'!N96","v":2},"Procrastination"]
["37-When I am hurting, I still do what needs to be done. ",null,null,null,null,null,null,{"$f":"'Quest T1'!N112","v":5},{"$f":"'Quest T2'!N97","v":5},"Distress endurance"]
["38-My life would be great if I never felt anxious.",null,null,null,null,null,null,{"$f":"'Quest T1'!N113","v":5},{"$f":"'Quest T2'!N98","v":5},"Distress aversion"]
["39-If I am starting to feel trapped, I leave the situation immediately. ",null,null,null,null,null,null,{"$f":"'Quest T1'!N114","v":4},{"$f":"'Quest T2'!N99","v":2},"Behavioral avoidance"]
["40-When a negative thought comes up, I immediately try to think of something else.",null,null,null,null,null,null,{"$f":"'Quest T1'!N115","v":4},{"$f":"'Quest T2'!N100","v":2},"Distraction suppression"]
["41-It’s hard for me to know what I’m feeling. ",null,null,null,null,null,null,{"$f":"'Quest T1'!N116","v":3},{"$f":"'Quest T2'!N101","v":4},"Repression and denial"]
["42-I won’t do something until I absolutely have to. ",null,null,null,null,null,null,{"$f":"'Quest T1'!N117","v":1},{"$f":"'Quest T2'!N102","v":1},"Procrastination"]
["43-I don’t let pain and discomfort stop me from getting what I want. ",null,null,null,null,null,null,{"$f":"'Quest T1'!N118","v":5},{"$f":"'Quest T2'!N103","v":2},"Distress endurance"]
["44-I would give up a lot not to feel bad.",null,null,null,null,null,null,{"$f":"'Quest T1'!N119","v":2},{"$f":"'Quest T2'!N104","v":2},"Distress aversion"]
["45-I go out of my way to avoid uncomfortable situations. ",null,null,null,null,null,null,{"$f":"'Quest T1'!N120","v":4},{"$f":"'Quest T2'!N105","v":3},"Behavioral avoidance"]
["46-I can numb my feelings when they are too intense.",null,null,null,null,null,null,{"$f":"'Quest T1'!N121","v":1},{"$f":"'Quest T2'!N106","v":1},"Repression and denial"]
["47-Why do today what you can put off until tomorrow.",null,null,null,null,null,null,{"$f":"'Quest T1'!N122","v":1},{"$f":"'Quest T2'!N107","v":1},"Procrastination"]
["48-I am willing to put up with sadness to get what I want. ",null,null,null,null,null,null,{"$f":"'Quest T1'!N123","v":3},{"$f":"'Quest T2'!N108","v":4},"Distress endurance"]
["49-Some people have told me that I “hide my head in the sand ». ",null,null,null,null,null,null,{"$f":"'Quest T1'!N124","v":1},{"$f":"'Quest T2'!N109","v":1},"Repression and denial"]
["50-Pain always leads to suffering.",null,null,null,null,null,null,{"$f":"'Quest T1'!N125","v":2},{"$f":"'Quest T2'!N110","v":3},"Distress aversion"]
["51-If I am in a slightly uncomfortable situation, I try to leave right away.",null,null,null,null,null,null,{"$f":"'Quest T1'!N126","v":1},{"$f":"'Quest T2'!N111","v":1},"Behavioral avoidance"]
["52-It takes me awhile to realize when I’m feeling bad. ",null,null,null,null,null,null,{"$f":"'Quest T1'!N127","v":3},{"$f":"'Quest T2'!N112","v":2},"Repression and denial"]
["53-I continue working toward my goals even if I have doubts. ",null,null,null,null,null,null,{"$f":"'Quest T1'!N128","v":4},{"$f":"'Quest T2'!N113","v":4},"Distress endurance"]
["54-I wish I could get rid of all of my negative emotions. ",null,null,null,null,null,null,{"$f":"'Quest T1'!N129","v":5},{"$f":"'Quest T2'!N114","v":4},"Distress aversion"]
["55-I avoid situations if there is a chance that I’ll feel nervous. ",null,null,null,null,null,null,{"$f":"'Quest T1'!N130","v":3},{"$f":"'Quest T2'!N115","v":3},"Behavioral avoidance"]
["56-I feel disconnected from my emotions.",null,null,null,null,null,null,{"$f":"'Quest T1'!N131","v":1},{"$f":"'Quest T2'!N116","v":1},"Repression and denial"]
["57-I don’t let gloomy thoughts stop me from doing what I want. ",null,null,null,null,null,null,{"$f":"'Quest T1'!N132","v":5},{"$f":"'Quest T2'!N117","v":6},"Distress endurance"]
["58-The key to a good life is never feeling any pain.",null,null,null,null,null,null,{"$f":"'Quest T1'!N133","v":1},{"$f":"'Quest T2'!N118","v":1},"Distress aversion"]
["59-I’m quick to leave any situation that makes me feel uneasy. ",null,null,null,null,null,null,{"$f":"'Quest T1'!N134","v":2},{"$f":"'Quest T2'!N119","v":1},"Behavioral avoidance"]
["60-People have told me that I’m not aware of my problems. ",null,null,null,null,null,null,{"$f":"'Quest T1'!N135","v":1},{"$f":"'Quest T2'!N120","v":1},"Repression and denial"]
["61-I hope to live without any sadness and disappointment.",null,null,null,null,null,null,{"$f":"'Quest T1'!N136","v":3},{"$f":"'Quest T2'!N121","v":2},"Distress aversion"]
["62-When working on something important, I won’t quit even if things get difficult. ",null,null,null,null,null,null,{"$f":"'Quest T1'!N137","v":6},{"$f":"'Quest T2'!N122","v":6},"Distress endurance"]
[]
[null,"T1",null,null,"T2",null,null,null,null,null,null,"Confidence level"]
[null,"Sum","Men","Percentile","Sum","Men","Percentile","d","Sdiff","RCI","d/SD","Two-tailed","One-tailed"]
["Behavioral avoidance",{"$f":"H8+H15+H21+H27+H33+H39+H46+H52+H58+H62+H66","v":35},{"$f":"B73/11","v":3.1818181818181817},{"$f":"NORMDIST(B73,$I$163,$J$163,TRUE)*100","v":52.29810667816777},{"$f":"I8+I15+I21+I27+I33+I39+I46+I52+I58+I62+I66","v":23},{"$f":"E73/11","v":2.0909090909090908},{"$f":"NORMDIST(E73,$I$163,$J$163,TRUE)*100","v":13.673622498712326},{"$f":"E73-B73","v":-12},{"$f":"SQRT(2*(J163*SQRT(1-K163))^2)","v":10.41},{"$f":"H73/I73","v":-1.1527377521613833},{"$f":"H73/J163","v":-1.1527377521613833},{"$f":"IF(ABS(J73)>0.84,(1-((1-_xlfn.NORM.S.DIST(ABS(J73),TRUE))*2)),\"no change\")","v":0.75098195902729925},{"$f":"IF(ABS(J73)>0.84,_xlfn.NORM.S.DIST(ABS(J73),TRUE),\"no change\")","v":0.87549097951364963}]
["Distress aversion",{"$f":"H9+H14+H20+H26+H32+H38+H41+H45+H51+H57+H61+H65+H68","v":40},{"$f":"B74/13","v":3.0769230769230771},{"$f":"NORMDIST(B74,$I$164,$J$164,TRUE)*100","v":44.518161298570348},{"$f":"I9+I14+I20+I26+I32+I38+I41+I45+I51+I57+I61+I65+I68","v":39},{"$f":"E74/13","v":3},{"$f":"NORMDIST(E74,$I$164,$J$164,TRUE)*100","v":41.239563463338236},-1,11.97,{"$f":"H74/I74","v":-8.3542188805346695E-2},-8.3542188805346695E-2,{"$f":"IF(ABS(J74)>0.84,(1-((1-_xlfn.NORM.S.DIST(ABS(J74),TRUE))*2)),\"no change\")","v":"no change"},{"$f":"IF(ABS(J74)>0.84,_xlfn.NORM.S.DIST(ABS(J74),TRUE),\"no change\")","v":"no change"}]
["Procrastination",{"$f":"H12+H18+H24+(7-H37)+H43+H49+H54","v":12},{"$f":"B75/7","v":1.7142857142857142},{"$f":"NORMDIST(B75,$I$165,$J$165,TRUE)*100","v":8.1159367972455954},{"$f":"I12+I18+I24+(7-I37)+I43+I49+I54","v":12},{"$f":"E75/7","v":1.7142857142857142},{"$f":"NORMDIST(E75,$I$165,$J$165,TRUE)*100","v":8.1159367972455954},0,7.45,0,0,"no change","no change"]
["Distraction and suppression",{"$f":"H10+H16+H22+H29+H34+H40+H47","v":22},{"$f":"B76/7","v":3.1428571428571428},{"$f":"NORMDIST(B76,$I$166,$J$166,TRUE)*100","v":29.006614701702944},{"$f":"I10+I16+I22+I29+I34+I40+I47","v":14},{"$f":"E76/7","v":2},{"$f":"NORMDIST(E76,$I$166,$J$166,TRUE)*100","v":3.8447190912849316},-8,6.58,-1.21580547112462,-1.21580547112462,0.77594096583661698,0.88797048291830849]
["Repression and denial",{"$f":"H11+H17+H23+H28+(7-H30)+H35+H42+H48+H53+H56+H59+H63+H67","v":23},{"$f":"B77/13","v":1.7692307692307692},{"$f":"NORMDIST(B77,$I$167,$J$167,TRUE)*100","v":22.017931782213669},{"$f":"I11+I17+I23+I28+(7-I30)+I35+I42+I48+I53+I56+I59+I63+I67","v":22},{"$f":"E77/13","v":1.6923076923076923},{"$f":"NORMDIST(E77,$I$167,$J$167,TRUE)*100","v":19.367359292515342},-1,10.770000000000001,-9.2850510677808723E-2,-9.2850510677808737E-2,"no change","no change"]
["Distress endurance",{"$f":"H13+H19+H25+H31+H36+H44+H50+H55+H60+H64+H69","v":49},{"$f":"B78/11","v":4.4545454545454541},{"$f":"NORMDIST(B78,$I$168,$J$168,TRUE)*100","v":59.370046432567534},{"$f":"I13+I19+I25+I31+I36+I44+I50+I55+I60+I64+I69","v":45},{"$f":"E78/11","v":4.0909090909090908},{"$f":"NORMDIST(E78,$I$168,$J$168,TRUE)*100","v":39.460399675392004},-4,7.93,-0.50441361916771754,-0.50441361916771754,"no change","no change"]
["TOTAL",{"$f":"B73+B74+B75+B76+B77+(77-B78)","v":160},"-",{"$f":"NORMDIST(B79,$I$169,$J$169,TRUE)*100","v":26.335333611730039},{"$f":"E73+E74+E75+E76+E77+(77-E78)","v":142},"-",{"$f":"NORMDIST(E79,$I$169,$J$169,TRUE)*100","v":13.927009612735402},-18,39.950000000000003,-0.45056320400500621,-0.45056320400500621,"no change","no change"]
[]
["Norms (Adults, Students, Psychiatric population)","Adults"]
[]
[]
[]
[]
[]
[]
[]
[]
[]
[]
[]
[]
[]
[]
[]
[]
[]
[]
[]
[]
[]
[]
[]
[]
[]
[]
[]
[]
[]
[]
[]
[]
[]
[]
[]
[]
[]
[]
[]
[]
[]
[]
[]
[]
[]
[]
[]
[]
[]
[]
[]
[]
[]
[]
[]
[]
[]
[]
[]
[]
[]
[]
[]
[]
[]
[]
[]
[]
[]
[]
[]
[]
[]
[]
[]
[]
[]
[]
[null,"Norms",null,null,null,null,null,null,"Norme utilisée"]
[null,"Adults (N=201)",null,"Students (N=667)",null,"Psychiatric population (N=466)",null,null,{"$f":"IF($B$81=\"Adults\",B161,IF($B$81=\"Students\",D161,IF($B$81=\"Psychiatric population\",F161)))","v":"Adults (N=201)"},{"$f":"IF($B$81=\"Adults\",C161,IF($B$81=\"Students\",E161,IF($B$81=\"Psychiatric population\",G161)))","v":0}]
[null,"M","SD","M","SD","M","SD",null,"M","SD","rxx"]
[null,34.4,10.41,36.26,8.6999999999999993,42.36,11.13,null,34.4,10.41,0.5]
[null,41.65,11.97,43.24,11.46,50.47,12.63,null,41.65,11.97,0.5]
[null,22.41,7.45,25.04,6.61,26.62,7,null,22.41,7.45,0.5]
[null,25.64,6.58,26.02,6.35,28.79,7.55,null,25.64,6.58,0.5]
[null,31.31,10.77,34.020000000000003,10.6,37.82,12.33,null,31.31,10.77,0.5]
[null,47.12,7.93,46.51,7.66,43.21,9.57,null,47.12,7.93,0.5]
[null,185.29,39.950000000000003,195.08,34.46,224.61,39.94,null,185.29,39.950000000000003,0.5]
[]
[]
[]
[]
[]
[]
[]
[]
[]
[]
[]
[]
[]
[]
[]
[]
[]
[]
[]
[]
[]
[]
[]
[]
[]
[]
[]
[]
[]
[]
[]
[]
[]
[]
[]
[]
[]
[]
[]
[]
[]
[]
[]
[]
[]
[]
[]
[]
[]
[]
[]
[]
[]
[]
[]
[]
[]
[]
[]
[]
[]
[]
[]
[]
[]
[]
[]
[]
[]
[]
[]
[]
[]
[]
[]
[]
[]
[]
[]
[]
[]
[]
[]
[]
[]
[]
[]
[]
[]
[]
[]
[]
[]
[]
[]
[]
[]
[]
[]
[]
[]
[]
[null,null,null,null,"Dimension 1",null,null,null,null,null,"Dimension 2",null,null,null,null,null,"Dimension3",null,null,null,null,null,"Dimension4",null,null,null,null,null,"Dimension 5",null,null,null,null,null,"Dimension 6",null,null,null,null,null,"Dimension 7"]
[null,null,null,null,{"$f":"$A$73","v":"Behavioral avoidance"},null,null,null,null,null,{"$f":"$A$74","v":"Distress aversion"},null,null,null,null,null,{"$f":"$A$75","v":"Procrastination"},null,null,null,null,null,{"$f":"$A$76","v":"Distraction and suppression"},null,null,null,null,null,{"$f":"$A$77","v":"Repression and denial"},null,null,null,null,null,{"$f":"$A$78","v":"Distress endurance"},null,null,null,null,null,{"$f":"$A$79","v":"TOTAL"}]
[null,null,null,null,"T1",{"$f":"$B$73","v":35},null,null,null,null,"T1",{"$f":"$B$74","v":40},null,null,null,null,"T1",{"$f":"$B$75","v":12},null,null,null,null,"T1",{"$f":"$B$76","v":22},null,null,null,null,"T1",{"$f":"$B$77","v":23},null,null,null,null,"T1",{"$f":"$B$78","v":49},null,null,null,null,"T1",{"$f":"$B$79","v":160}]
[null,null,null,null,"T2",{"$f":"$E$73","v":23},null,null,null,null,"T2",{"$f":"$E$74","v":39},null,null,null,null,"T2",{"$f":"$E$75","v":12},null,null,null,null,"T2",{"$f":"$E$76","v":14},null,null,null,null,"T2",{"$f":"$E$77","v":22},null,null,null,null,"T2",{"$f":"$E$78","v":45},null,null,null,null,"T2",{"$f":"$E$79","v":142}]
[null,null,null,null,"norme M",{"$f":"$I$163","v":34.4},null,null,null,null,"norme M",{"$f":"$I$164","v":41.65},null,null,null,null,"norme M",{"$f":"$I$165","v":22.41},null,null,null,null,"norme M",{"$f":"$I$166","v":25.64},null,null,null,null,"norme M",{"$f":"$I$167","v":31.31},null,null,null,null,"norme M",{"$f":"$I$168","v":47.12},null,null,null,null,"norme M",{"$f":"$I$169","v":185.29}]
[null,null,null,null,"norme SD",{"$f":"$J$163","v":10.41},null,null,null,null,"norme SD",{"$f":"$J$164","v":11.97},null,null,null,null,"norme SD",{"$f":"$J$165","v":7.45},null,null,null,null,"norme SD",{"$f":"$J$166","v":6.58},null,null,null,null,"norme SD",{"$f":"$J$167","v":10.77},null,null,null,null,"norme SD",{"$f":"$J$168","v":7.93},null,null,null,null,"norme SD",{"$f":"$J$169","v":39.950000000000003}]
[null,null,null,null,null,null,"x","densité",null,null,null,null,"x","densité",null,null,null,null,"x","densité",null,null,null,null,"x","densité",null,null,null,null,"x","densité",null,null,null,null,"x","densité",null,null,null,null,"x","densité"]
[null,null,null,null,-30,{"$f":"E279*F$277/10","v":-31.23},{"$f":"F279+F$276","v":3.1699999999999982},{"$f":"NORMDIST(G279,F$276,F$277,FALSE)","v":4.2572991469145123E-4},1,null,-30,{"$f":"K279*L$277/10","v":-35.910000000000004},{"$f":"L279+L$276","v":5.7399999999999949},{"$f":"NORMDIST(M279,L$276,L$277,FALSE)","v":3.7024631678680091E-4},1,null,-30,{"$f":"Q279*R$277/10","v":-22.35},{"$f":"R279+R$276","v":5.9999999999998721E-2},{"$f":"NORMDIST(S279,R$276,R$277,FALSE)","v":5.9487898146818891E-4},1,null,-30,{"$f":"W279*X$277/10","v":-19.740000000000002},{"$f":"X279+X$276","v":5.8999999999999986},{"$f":"NORMDIST(Y279,X$276,X$277,FALSE)","v":6.7353319330364732E-4},1,null,-30,{"$f":"AC279*AD$277/10","v":-32.309999999999995},{"$f":"AD279+AD$276","v":-0.99999999999999645},{"$f":"NORMDIST(AE279,AD$276,AD$277,FALSE)","v":4.114993882950804E-4},1,null,-30,{"$f":"AI279*AJ$277/10","v":-23.79},{"$f":"AJ279+AJ$276","v":23.33},{"$f":"NORMDIST(AK279,AJ$276,AJ$277,FALSE)","v":5.5887117426708802E-4},1,null,-30,{"$f":"AO279*AP$277/10","v":-119.85},{"$f":"AP279+AP$276","v":65.44},{"$f":"NORMDIST(AQ279,AP$276,AP$277,FALSE)","v":1.1093487889707172E-4},1]
[null,null,null,null,{"$f":"E279+0.5","v":-29.5},{"$f":"E280*F$277/10","v":-30.709500000000002},{"$f":"F280+F$276","v":3.6904999999999966},4.9400969481786156E-4,2,null,{"$f":"K279+0.5","v":-29.5},{"$f":"K280*L$277/10","v":-35.311500000000002},{"$f":"L280+L$276","v":6.3384999999999962},4.2962747895187461E-4,2,null,{"$f":"Q279+0.5","v":-29.5},{"$f":"Q280*R$277/10","v":-21.977499999999999},{"$f":"R280+R$276","v":0.43250000000000099},6.9028737222200586E-4,2,null,{"$f":"W279+0.5","v":-29.5},{"$f":"W280*X$277/10","v":-19.411000000000001},{"$f":"X280+X$276","v":6.2289999999999992},7.8155637128479315E-4,2,null,{"$f":"AC279+0.5","v":-29.5},{"$f":"AC280*AD$277/10","v":-31.771499999999996},{"$f":"AD280+AD$276","v":-0.46149999999999736},4.7749683593815631E-4,2,null,{"$f":"AI279+0.5","v":-29.5},{"$f":"AI280*AJ$277/10","v":-23.3935},{"$f":"AJ280+AJ$276","v":23.726499999999998},6.4850453001941231E-4,2,null,{"$f":"AO279+0.5","v":-29.5},{"$f":"AO280*AP$277/10","v":-117.85250000000001},{"$f":"AP280+AP$276","v":67.437499999999986},1.2872693174102484E-4,2]
[null,null,null,null,{"$f":"E280+0.5","v":-29},-30.189,4.2109999999999985,5.7180907010334809E-4,3,null,{"$f":"K280+0.5","v":-29},-34.713000000000001,6.9369999999999976,4.9728758728286157E-4,3,null,{"$f":"Q280+0.5","v":-29},-21.605,0.80499999999999972,7.9899764023836967E-4,3,null,{"$f":"W280+0.5","v":-29},-19.082000000000001,6.5579999999999998,9.0464018537626952E-4,3,null,{"$f":"AC280+0.5","v":-29},-31.232999999999997,7.7000000000001734E-2,5.5269567500240051E-4,3,null,{"$f":"AI280+0.5","v":-29},-22.997,24.122999999999998,7.5063460526807744E-4,3,null,{"$f":"AO280+0.5","v":-29},-115.85500000000002,69.434999999999974,1.4899955994432661E-4,3]
[null,null,null,null,-28.5,-29.668500000000002,4.7314999999999969,6.6020813550566487E-4,4,null,-28.5,-34.114500000000007,7.5354999999999919,5.7416597248236966E-4,4,null,-28.5,-21.232500000000002,1.1774999999999984,9.2251901887435846E-4,4,null,-28.5,-18.753,6.8870000000000005,1.0444934180264393E-3,4,null,-28.5,-30.694499999999998,0.61550000000000082,6.3813989699294067E-4,4,null,-28.5,-22.6005,24.519499999999997,8.6667928002698259E-4,4,null,-28.5,-113.8575,71.43249999999999,1.7203421002788427E-4,4]
[null,null,null,null,-28,-29.148000000000003,5.2519999999999953,7.6036998875888163E-4,5,null,-28,-33.516000000000005,8.1339999999999932,6.612741506248919E-4,5,null,-28,-20.86,1.5500000000000007,1.0624767225476466E-3,5,null,-28,-18.423999999999999,7.2160000000000011,1.202956167626135E-3,5,null,-28,-30.155999999999999,1.1539999999999999,7.3495372172515956E-4,5,null,-28,-22.204000000000001,24.915999999999997,9.9816539507943973E-4,5,null,-28,-111.86000000000001,73.429999999999978,1.9813395702077485E-4,5]
[null,null,null,null,-27.5,-28.627499999999998,5.7725000000000009,8.7354106643526086E-4,6,null,-27.5,-32.917500000000004,8.7324999999999946,7.5969611542114055E-4,6,null,-27.5,-20.487500000000001,1.9224999999999994,1.2206124163209467E-3,6,null,-27.5,-18.094999999999999,7.5450000000000017,1.382000380181011E-3,6,null,-27.5,-29.6175,1.692499999999999,8.4434192215330107E-4,6,null,-27.5,-21.807499999999997,25.3125,1.146729193138848E-3,6,null,-27.5,-109.8625,75.427499999999995,2.2762359202981388E-4,6]
[null,null,null,null,-27,-28.106999999999999,6.2929999999999993,1.0010504144498181E-3,7,null,-27,-32.319000000000003,9.330999999999996,8.7058770379470256E-4,7,null,-27,-20.115000000000002,2.2949999999999982,1.3987831965667906E-3,7,null,-27,-17.765999999999998,7.8740000000000023,1.5837286952010035E-3,7,null,-27,-29.078999999999997,2.2310000000000016,9.6758911925929486E-4,7,null,-27,-21.410999999999998,25.709,1.3141153612134433E-3,7,null,-27,-107.86500000000001,77.424999999999983,2.6084943215075318E-4,7]
[null,null,null,null,-26.5,-27.586500000000001,6.8134999999999977,1.1443077432858001E-3,8,null,-26.5,-31.720500000000005,9.9294999999999938,9.951749045618353E-4,8,null,-26.5,-19.7425,2.6675000000000004,1.5989588735040509E-3,8,null,-26.5,-17.437000000000001,8.2029999999999994,1.8103713689369557E-3,8,null,-26.5,-28.540499999999998,2.7695000000000007,1.1060579022846035E-3,8,null,-26.5,-21.014499999999998,26.105499999999999,1.5021744776299091E-3,8,null,-26.5,-105.86750000000002,79.422499999999971,2.9817881370726332E-4,8]
[null,null,null,null,-26,-27.066000000000003,7.3339999999999961,1.304800118509665E-3,9,null,-26,-31.122000000000003,10.527999999999995,1.1347509802577789E-3,9,null,-26,-19.37,3.0399999999999991,1.823217346803438E-3,9,null,-26,-17.108000000000001,8.532,2.0642810385540443E-3,9,null,-26,-28.001999999999999,3.3079999999999998,1.2611856298686734E-3,9,null,-26,-20.618000000000002,26.501999999999995,1.7128586675517787E-3,9,null,-26,-103.87,81.419999999999987,3.3999922987948964E-4,9]
[null,null,null,null,-25.5,-26.545499999999997,7.8545000000000016,1.4840871406719667E-3,10,null,-25.5,-30.523500000000002,11.126499999999997,1.2906722752209837E-3,10,null,-25.5,-18.997499999999999,3.4125000000000014,2.0737378703886136E-3,10,null,-25.5,-16.779,8.8610000000000007,2.3479250964126403E-3,10,null,-25.5,-27.4635,3.8464999999999989,1.4344797710673315E-3,10,null,-25.5,-20.221499999999999,26.898499999999999,1.9482152754596691E-3,10,null,-25.5,-101.8725,83.41749999999999,3.8671707470325841E-4,10]
[null,null,null,null,-25,-26.024999999999999,8.375,1.6837944758471219E-3,11,null,-25,-29.925000000000001,11.724999999999998,1.4643525892705546E-3,11,null,-25,-18.625,3.7850000000000001,2.3527920125595357E-3,11,null,-25,-16.45,9.1900000000000013,2.6638754549496257E-3,11,null,-25,-26.925000000000001,4.384999999999998,1.6275116521419256E-3,11,null,-25,-19.824999999999999,27.294999999999998,2.2103783724550493E-3,11,null,-25,-99.875000000000014,85.414999999999978,4.3875595728582069E-4,11]
[null,null,null,null,-24.5,-25.5045,8.8954999999999984,1.9056056092022395E-3,12,null,-24.5,-29.326500000000003,12.323499999999996,1.6572560059979376E-3,12,null,-24.5,-18.252500000000001,4.1574999999999989,2.6627321331268872E-3,12,null,-24.5,-16.121000000000002,9.5189999999999984,3.0147955002728438E-3,12,null,-24.5,-26.386500000000002,4.9234999999999971,1.8419084857748667E-3,12,null,-24.5,-19.4285,27.691499999999998,2.5015579308695223E-3,12,null,-24.5,-97.877500000000012,87.41249999999998,4.9655455298611541E-4,12]
[null,null,null,null,-24,-24.984000000000002,9.4159999999999968,2.1512517093989318E-3,13,null,-24,-28.728000000000002,12.921999999999997,1.8708880780988219E-3,13,null,-24,-17.880000000000003,4.5299999999999976,3.0059772207842793E-3,13,null,-24,-15.792000000000002,9.847999999999999,3.4034240569670031E-3,13,null,-24,-25.848000000000003,5.4619999999999962,2.0793435742658202E-3,13,null,-24,-19.032,28.087999999999997,2.8240265188956997E-3,13,null,-24,-95.88000000000001,89.409999999999982,5.6056396232397748E-4,13]
[null,null,null,null,-23.5,-24.4635,9.9364999999999988,2.4224995115460501E-3,14,null,-23.5,-28.1295,13.520499999999998,2.1067852894899233E-3,14,null,-23.5,-17.5075,4.9024999999999999,3.3849959617710582E-3,14,null,-23.5,-15.462999999999999,10.177000000000001,3.8325562181146526E-3,14,null,-23.5,-25.3095,6.0004999999999988,2.3415245975110847E-3,14,null,-23.5,-18.6355,28.484499999999997,3.1801033940976522E-3,14,null,-23.5,-93.882500000000007,91.407499999999985,6.3124455357182433E-4,14]
[null,null,null,null,-23,-23.943000000000001,10.456999999999997,2.7211371509703319E-3,15,null,-23,-27.530999999999999,14.119,2.3665027353050282E-3,15,null,-23,-17.134999999999998,5.2750000000000021,3.802286945181367E-3,15,null,-23,-15.134,10.506,4.3050209333740401E-3,15,null,-23,-24.770999999999997,6.5390000000000015,2.6301799202972319E-3,15,null,-23,-18.238999999999997,28.881,3.5721359068853955E-3,15,null,-23,-91.885000000000005,93.404999999999987,7.090622713792537E-4,15]
[null,null,null,null,-22.5,-23.422499999999999,10.977499999999999,3.0489579092860155E-3,16,null,-22.5,-26.932499999999997,14.717500000000001,2.6515999862712987E-3,16,null,-22.5,-16.762499999999999,5.6475000000000009,4.2603559510962976E-3,16,null,-22.5,-14.805000000000001,10.834999999999999,4.8236552941743798E-3,16,null,-22.5,-24.232499999999998,7.0775000000000006,2.947042881677569E-3,16,null,-22.5,-17.842499999999998,29.2775,4.0024781633880768E-3,16,null,-22.5,-89.887500000000017,95.402499999999975,7.9448440139342656E-4,16]
[null,null,null,null,-22,-22.902000000000001,11.497999999999998,3.4077418680337583E-3,17,null,-22,-26.334000000000003,15.315999999999995,2.9636251333526667E-3,17,null,-22,-16.39,6.02,4.7616903149303924E-3,17,null,-22,-14.475999999999999,11.164000000000001,5.391275508545814E-3,17,null,-22,-23.693999999999999,7.6159999999999997,3.293834061859928E-3,17,null,-22,-17.445999999999998,29.673999999999999,4.4734669415172077E-3,17,null,-22,-87.890000000000015,97.399999999999977,8.8797478964283911E-4,17]
[null,null,null,null,-21.5,-22.381499999999999,12.0185,3.7992355033016545E-3,18,null,-21.5,-25.735500000000002,15.914499999999997,3.3040970417184813E-3,18,null,-21.5,-16.017500000000002,6.3924999999999983,5.3087304146805618E-3,18,null,-21.5,-14.147,11.493,6.0106446184453226E-3,18,null,-21.5,-23.155499999999996,8.1545000000000023,3.6722415589015987E-3,18,null,-21.5,-17.049500000000002,30.070499999999996,4.9873949040819916E-3,18,null,-21.5,-85.892500000000013,99.39749999999998,9.8998852539099332E-4,18]
[null,null,null,null,-21,-21.861000000000001,12.538999999999998,4.225129296871008E-3,19,null,-21,-25.137,16.512999999999998,3.6744858797349367E-3,19,null,-21,-15.645000000000001,6.7649999999999988,5.9038383866345219E-3,19,null,-21,-13.818000000000001,11.821999999999999,6.6844370790922784E-3,19,null,-21,-22.616999999999997,8.6930000000000014,4.0838993482290838E-3,19,null,-21,-16.652999999999999,30.466999999999999,5.5464812081244879E-3,19,null,-21,-83.89500000000001,101.39499999999998,1.1009661071446106E-3,19]
[null,null,null,null,-20.5,-21.340499999999999,13.0595,4.6870334850319662E-3,20,null,-20.5,-24.538500000000003,17.111499999999996,4.0761920283360663E-3,20,null,-20.5,-15.272499999999999,7.1375000000000011,6.5492642388164787E-3,20,null,-20.5,-13.489000000000001,12.151,7.4152003919730584E-3,20,null,-20.5,-22.078499999999998,9.2315000000000005,4.5303638420782517E-3,20,null,-20.5,-16.256499999999999,30.863499999999998,6.1528396695060238E-3,20,null,-20.5,-81.897500000000008,103.39249999999998,1.2213271233837977E-3,20]
[null,null,null,null,-20,-20.82,13.579999999999998,5.1864521146194097E-3,21,null,-20,-23.94,17.709999999999997,4.5105235182279074E-3,21,null,-20,-14.9,7.51,7.2471095990856455E-3,21,null,-20,-13.16,12.48,8.2053140597550239E-3,21,null,-20,-21.54,9.77,5.0130888127379817E-3,21,null,-20,-15.86,31.259999999999998,6.8084447053200579E-3,21,null,-20,-79.900000000000006,105.38999999999999,1.3514634921949452E-3,21]
[null,null,null,null,-19.5,-20.299500000000002,14.100499999999997,5.7247556262071128E-3,22,null,-19.5,-23.341500000000003,18.308499999999995,4.9786721862001716E-3,22,null,-19.5,-14.5275,7.8825000000000003,7.9992894052102123E-3,22,null,-19.5,-12.831,12.809000000000001,9.0569462110662736E-3,22,null,-19.5,-21.0015,10.308499999999999,5.5333988921834774E-3,22,null,-19.5,-15.4635,31.656499999999998,7.5150953428519632E-3,22,null,-19.5,-77.902500000000003,107.38749999999999,1.4917323171167978E-3,22]
[null,null,null,null,-19,-19.779,14.620999999999999,6.3031522357998651E-3,23,null,-19,-22.743000000000002,18.906999999999996,5.4816887865226883E-3,23,null,-19,-14.155000000000001,8.254999999999999,8.8074919160639718E-3,23,null,-19,-12.501999999999999,13.138000000000002,9.9720083244189354E-3,23,null,-19,-20.463000000000001,10.846999999999998,6.0924619103692283E-3,23,null,-19,-15.066999999999998,32.052999999999997,8.2743776512833028E-3,23,null,-19,-75.905000000000001,109.38499999999999,1.6424484299042952E-3,23]
[null,null,null,null,-18.5,-19.258500000000002,15.141499999999997,6.9226584376770404E-3,24,null,-18.5,-22.144500000000001,19.505499999999998,6.0204573380299095E-3,24,null,-18.5,-13.782500000000002,8.6274999999999977,9.6731374947943566E-3,24,null,-18.5,-12.173,13.467000000000001,1.0952108561735256E-2,24,null,-18.5,-19.924500000000002,11.385499999999997,6.6912603840499491E-3,24,null,-18.5,-14.670499999999999,32.4495,9.0876260196996288E-3,24,null,-18.5,-73.907499999999999,111.38249999999999,1.8038767042858077E-3,24]
[null,null,null,null,-18,-18.738,15.661999999999999,7.5840690010465115E-3,25,null,-18,-21.545999999999999,20.103999999999999,6.5956690309853117E-3,25,null,-18,-13.41,9,1.0597336684683779E-2,25,null,-18,-11.843999999999999,13.796000000000001,1.1998504301047748E-2,25,null,-18,-19.385999999999999,11.923999999999999,7.3305625163318624E-3,25,null,-18,-14.274000000000001,32.845999999999997,9.9558837706045546E-3,25,null,-18,-71.91,113.38,1.976224237819629E-3,25]
[null,null,null,null,-17.5,-18.217500000000001,16.182499999999997,8.2879268805486576E-3,26,null,-17.5,-20.947500000000002,20.702499999999997,7.2077960590235194E-3,26,null,-17.5,-13.0375,9.3725000000000005,1.158084816463242E-2,26,null,-17.5,-11.515000000000001,14.125,1.3112054532904488E-2,26,null,-17.5,-18.8475,12.462499999999999,8.0108931129537174E-3,26,null,-17.5,-13.877500000000001,33.242499999999993,1.087986366034192E-2,26,null,-17.5,-69.912499999999994,115.3775,2.159632511301916E-3,26]
[null,null,null,null,-17,-17.696999999999999,16.702999999999999,9.0344935040237214E-3,27,null,-17,-20.349,21.300999999999998,7.8570657791885504E-3,27,null,-17,-12.665000000000001,9.7449999999999992,1.2624037231796899E-2,27,null,-17,-11.186,14.454000000000001,1.4293172853630234E-2,27,null,-17,-18.309000000000001,13.000999999999998,8.7325048632206984E-3,27,null,-17,-13.481,33.638999999999996,1.1859908874765058E-2,27,null,-17,-67.915000000000006,117.37499999999999,2.354169646480274E-3,27]
[null,null,null,null,-16.5,-17.176500000000001,17.223499999999998,9.8237199389027852E-3,28,null,-16.5,-19.750500000000002,21.899499999999996,8.5434356360883871E-3,28,null,-16.5,-12.2925,10.1175,1.3726835511943359E-2,28,null,-16.5,-10.857000000000001,14.782999999999999,1.5541781848628875E-2,28,null,-16.5,-17.770499999999998,13.5395,9.4953504701929467E-3,28,null,-16.5,-13.0845,34.035499999999999,1.2895955178307444E-2,28,null,-16.5,-65.917500000000004,119.37249999999999,2.559822892715345E-3,28]
[null,null,null,null,-16,-16.655999999999999,17.744,1.0655219469688337E-2,29,null,-16,-19.152000000000001,22.497999999999998,9.2665693132377228E-3,29,null,-16,-11.92,10.49,1.4888702641537662E-2,29,null,-16,-10.528,15.112,1.6857269708123943E-2,29,null,-16,-17.231999999999999,14.077999999999999,1.0299056144796245E-2,29,null,-16,-12.687999999999999,34.432000000000002,1.3987494915442074E-2,29,null,-16,-63.92,121.36999999999999,2.7764914813380621E-3,29]
[null,null,null,null,-15.5,-16.1355,18.264499999999998,1.1528242141881419E-2,30,null,-15.5,-18.5535,23.096499999999999,1.0025814594568559E-2,30,null,-15.5,-11.547500000000001,10.862499999999999,1.6108590697581956E-2,30,null,-15.5,-10.199,15.441000000000001,1.8238449953949177E-2,30,null,-15.5,-16.6935,14.616499999999998,1.1142897000648615E-2,30,null,-15.5,-12.291499999999999,34.828499999999998,1.513354359356691E-2,30,null,-15.5,-61.922499999999999,123.36749999999999,3.00397999241516E-3,30]
[null,null,null,null,-15,-15.615,18.784999999999997,1.2441651841103907E-2,31,null,-15,-17.955000000000002,23.694999999999997,1.0820183430734482E-2,31,null,-15,-11.175000000000001,11.234999999999999,1.7384912169918356E-2,31,null,-15,-9.870000000000001,15.77,1.9683525177187185E-2,31,null,-15,-16.154999999999998,15.155000000000001,1.2025774899339998E-2,31,null,-15,-11.895,35.224999999999994,1.6332609793933372E-2,31,null,-15,-59.924999999999997,125.36499999999999,3.2419923821249506E-3,31]
[null,null,null,null,-14.5,-15.0945,19.305499999999999,1.3393906478901083E-2,32,null,-14.5,-17.3565,24.293499999999998,1.1648334707214726E-2,32,null,-14.5,-10.8025,11.6075,1.8715512274545005E-2,32,null,-14.5,-9.5410000000000004,16.099,2.1190055690784238E-2,32,null,-14.5,-15.616499999999998,15.6935,1.2946199298547843E-2,32,null,-14.5,-11.4985,35.621499999999997,1.7582669160827274E-2,32,null,-14.5,-57.927500000000009,127.36249999999998,3.4901268196585789E-3,32]
[null,null,null,null,-14,-14.574000000000002,19.825999999999997,{"$f":"NORMDIST(G311,F$276,F$277,FALSE)","v":1.4383041847814105E-2},33,null,-14,-16.758000000000003,24.891999999999996,{"$f":"NORMDIST(M311,L$276,L$277,FALSE)","v":1.2508560203487453E-2},33,null,-14,-10.43,11.98,{"$f":"NORMDIST(S311,R$276,R$277,FALSE)","v":2.0097646394059716E-2},33,null,-14,-9.2119999999999997,16.428000000000001,{"$f":"NORMDIST(Y311,X$276,X$277,FALSE)","v":2.2754933987195271E-2},33,null,-14,-15.077999999999999,16.231999999999999,{"$f":"NORMDIST(AE311,AD$276,AD$277,FALSE)","v":1.3902271646772969E-2},33,null,-14,-11.102,36.018000000000001,{"$f":"NORMDIST(AK311,AJ$276,AJ$277,FALSE)","v":1.8881143207534042E-2},33,null,-14,-55.930000000000007,129.35999999999999,{"$f":"NORMDIST(AQ311,AP$276,AP$277,FALSE)","v":3.7478714802439256E-3},33]
[null,null,null,null,-13.5,-14.0535,20.346499999999999,1.5406659687023979E-2,34,null,-13.5,-16.159500000000001,25.490499999999997,1.339877421402837E-2,34,null,-13.5,-10.057500000000001,12.352499999999999,2.1527963401599945E-2,34,null,-13.5,-8.8829999999999991,16.757000000000001,2.4374365857434594E-2,34,null,-13.5,-14.539499999999999,16.770499999999998,1.4891673847903398E-2,34,null,-13.5,-10.705499999999999,36.414499999999997,2.0224883649674601E-2,34,null,-13.5,-53.932500000000005,131.35749999999999,4.0146014353421673E-3,34]
[null,null,null,null,-13,-13.533000000000001,20.866999999999997,1.6461920465687545E-2,35,null,-13,-15.561000000000002,26.088999999999999,1.4316507272164361E-2,35,null,-13,-9.6850000000000005,12.725,2.300249557688689E-2,35,null,-13,-8.5540000000000003,17.085999999999999,2.6043858973830901E-2,35,null,-13,-14.000999999999999,17.308999999999997,1.5911661285775983E-2,35,null,-13,-10.309000000000001,36.810999999999993,2.1610162931627642E-2,35,null,-13,-51.935000000000002,133.35499999999999,4.289576772160384E-3,35]
[null,null,null,null,-12.5,-13.012499999999999,21.387499999999999,1.7545541343806138E-2,36,null,-12.5,-14.9625,26.6875,1.5258904376693564E-2,36,null,-12.5,-9.3125,13.0975,2.4516655756915695E-2,36,null,-12.5,-8.2249999999999996,17.414999999999999,2.775821966398509E-2,36,null,-12.5,-13.4625,17.847499999999997,1.6959060853205376E-2,36,null,-12.5,-9.9124999999999996,37.207499999999996,2.3032671549687501E-2,36,null,-12.5,-49.937500000000007,135.35249999999999,4.571942062303427E-3,36]
[null,null,null,null,-12,-12.492000000000001,21.907999999999998,1.8653799710202972E-2,37,null,-12,-14.364000000000001,27.285999999999998,1.622272806877301E-2,37,null,-12,-8.9400000000000013,13.469999999999999,2.6065242279625894E-2,37,null,-12,-7.8960000000000008,17.744,2.9511558508087073E-2,37,null,-12,-12.924000000000001,18.385999999999996,1.8030274371700357E-2,37,null,-12,-9.516,37.603999999999999,2.448752269649597E-2,37,null,-12,-47.940000000000005,137.35,4.8607272836849302E-3,37]
[null,null,null,null,-11.5,-11.971500000000001,22.4285,1.9782542624397194E-2,38,null,-11.5,-13.765499999999999,27.884499999999999,1.7204366643272746E-2,38,null,-11.5,-8.567499999999999,13.842500000000001,2.7642452177177822E-2,38,null,-11.5,-7.5670000000000002,18.073,3.1297305276591907E-2,38,null,-11.5,-12.385499999999999,18.924500000000002,1.9121287717732111E-2,38,null,-11.5,-9.1194999999999986,38.000500000000002,2.5969264655734542E-2,38,null,-11.5,-45.942500000000003,139.3475,5.1548502808504322E-3,38]
[null,null,null,null,-11,-11.451000000000001,22.948999999999998,2.0927202404663836E-2,39,null,-11,-13.167000000000002,28.482999999999997,1.819984770530915E-2,39,null,-11,-8.1950000000000003,14.215,2.9241902957389335E-2,39,null,-11,-7.2379999999999995,18.402000000000001,3.3108233591573041E-2,39,null,-11,-11.847,19.463000000000001,2.0227685889744714E-2,39,null,-11,-8.722999999999999,38.396999999999998,2.7471901265138789E-2,39,null,-11,-43.945000000000007,141.34499999999997,5.4531208268473186E-3,39]
[null,null,null,null,-10.5,-10.9305,23.469499999999996,2.2082818509532465E-2,40,null,-10.5,-12.5685,29.081499999999998,1.9204857200019465E-2,40,null,-10.5,-7.8225000000000007,14.587499999999999,3.0856663179091675E-2,40,null,-10.5,-6.9090000000000007,18.731000000000002,3.4936495544716277E-2,40,null,-10.5,-11.308499999999999,20.0015,2.1344674158238913E-2,40,null,-10.5,-8.3264999999999993,38.793499999999995,2.8988920641139084E-2,40,null,-10.5,-41.947500000000005,143.34249999999997,5.7542463250120877E-3,40]
[null,null,null,null,-10,-10.41,23.99,2.3244065755921552E-2,41,null,-10,-11.97,29.68,2.021476395314481E-2,41,null,-10,-7.45,14.96,3.2479291881764218E-2,41,null,-10,-6.58,19.060000000000002,3.6773666340295351E-2,41,null,-10,-10.77,20.54,2.2467105340681835E-2,41,null,-10,-7.93,39.19,3.0513332221833965E-2,41,null,-10,-39.950000000000003,145.33999999999997,6.0568391619309951E-3,41]
[null,null,null,null,-9.5,-9.8895,24.5105,2.440528880587791E-2,42,null,-9.5,-11.371500000000001,30.278499999999998,2.1224649663257225E-2,42,null,-9.5,-7.0775000000000006,15.3325,3.4101886774387781E-2,42,null,-9.5,-6.2509999999999994,19.389000000000003,3.8610798855499867E-2,42,null,-9.5,-10.2315,21.078499999999998,2.3589513135486444E-2,42,null,-9.5,-7.5334999999999992,39.586500000000001,3.2037712038989807E-2,42,null,-9.5,-37.952500000000001,147.33749999999998,6.3594256938470321E-3,42]
[null,null,null,null,-9,-9.3689999999999998,25.030999999999999,2.5560542737632554E-2,43,null,-9,-10.773,30.876999999999999,2.2229344185359635E-2,43,null,-9,-6.7050000000000001,15.705,3.5716140926007355E-2,43,null,-9,-5.9219999999999997,19.718,4.0438487826558477E-2,43,null,-9,-9.6929999999999996,21.616999999999997,2.4706151336931735E-2,43,null,-9,-7.1370000000000005,39.982999999999997,3.3554255977144364E-2,43,null,-9,-35.954999999999998,149.33499999999998,6.6604568184919846E-3,43]
[null,null,null,null,-8.5,-8.8484999999999996,25.551499999999997,2.6703639397790243E-2,44,null,-8.5,-10.1745,31.475499999999997,2.3223465842188505E-2,44,null,-8.5,-6.3325000000000005,16.077500000000001,3.7313407534361943E-2,44,null,-8.5,-5.593,20.047000000000001,4.22469431810025E-2,44,null,-8.5,-9.1545000000000005,22.155499999999996,2.5811038637975531E-2,44,null,-8.5,-6.7404999999999999,40.3795,3.5054840621815457E-2,44,null,-8.5,-33.957500000000003,151.33249999999998,6.9583200533415877E-3,44]
[null,null,null,null,-8,-8.3279999999999994,26.071999999999999,2.7828199112534365E-2,45,null,-8,-9.5760000000000005,32.073999999999998,2.4201466396113844E-2,45,null,-8,-5.96,16.45,3.8884772182749362E-2,45,null,-8,-5.2640000000000002,20.376000000000001,4.4026071848249658E-2,45,null,-8,-8.6159999999999997,22.693999999999999,2.6898008612951042E-2,45,null,-8,-6.3439999999999994,40.775999999999996,3.6531091142683825E-2,45,null,-8,-31.96,153.32999999999998,7.2513530102999426E-3,45]
[null,null,null,null,-7.5,-7.8075000000000001,26.592499999999998,2.892770721948169E-2,46,null,-7.5,-8.9775000000000009,32.672499999999999,2.5157680213433953E-2,46,null,-7.5,-5.5875000000000004,16.822499999999998,4.0421131832859648E-2,46,null,-7.5,-4.9350000000000005,20.704999999999998,4.5765567196778774E-2,46,null,-7.5,-8.0774999999999988,23.232500000000002,2.7960764359777575E-2,46,null,-7.5,-5.9474999999999998,41.172499999999999,3.7974455505019482E-2,46,null,-7.5,-29.962499999999999,155.32749999999999,7.5378581265282693E-3,46]
[null,null,null,null,-7,-7.2870000000000008,27.113,2.9995574771062569E-2,47,null,-7,-8.3790000000000013,33.271000000000001,2.6086377056538126E-2,47,null,-7,-5.2149999999999999,17.195,4.1913279646545135E-2,47,null,-7,-4.6059999999999999,21.033999999999999,4.7455005070936356E-2,47,null,-7,-7.5389999999999997,23.771000000000001,2.8992937174258247E-2,47,null,-7,-5.5510000000000002,41.568999999999996,3.9376284157220838E-2,47,null,-7,-27.965000000000003,157.32499999999999,7.8161184822718704E-3,47]
[null,null,null,null,-6.5,-6.7665000000000006,27.633499999999998,3.1025202657820779E-2,48,null,-6.5,-7.7805000000000009,33.869499999999995,2.6981817850285233E-2,48,null,-6.5,-4.8425000000000002,17.567499999999999,4.3351994586297217E-2,48,null,-6.5,-4.2770000000000001,21.363,4.9083945238284847E-2,48,null,-6.5,-7.0004999999999997,24.3095,2.9988148529982762E-2,48,null,-6.5,-5.1545000000000005,41.965499999999999,4.0727914207807608E-2,48,null,-6.5,-25.967500000000001,159.32249999999999,8.0844145098351496E-3,48]
[null,null,null,null,-6,-6.2460000000000004,28.153999999999996,3.2010048308530221E-2,49,null,-6,-7.1820000000000004,34.467999999999996,2.7838312689373399E-2,49,null,-6,-4.4700000000000006,17.939999999999998,4.472813461634894E-2,49,null,-6,-3.9480000000000004,21.692,5.0642036913647367E-2,49,null,-6,-6.4620000000000006,24.847999999999999,3.0940074548913617E-2,49,null,-6,-4.758,42.361999999999995,4.2020756985094526E-2,49,null,-6,-23.970000000000002,161.32,8.3410413740125054E-3,49]
[null,null,null,null,-5.5,-5.7255000000000003,28.674499999999998,3.2943694046050326E-2,50,null,-5.5,-6.5835000000000008,35.066499999999998,2.8650280285662813E-2,50,null,-5.5,-4.0975000000000001,18.3125,4.6032732217366965E-2,50,null,-5.5,-3.6189999999999998,22.021000000000001,5.2119126902641935E-2,50,null,-5.5,-5.9234999999999998,25.386499999999998,3.1842512072366193E-2,50,null,-5.5,-4.3614999999999995,42.758499999999998,4.3246387770414112E-2,50,null,-5.5,-21.972500000000004,163.3175,8.5843267839645545E-3,50]
[null,null,null,null,-5,-5.2050000000000001,29.195,3.3819916115686792E-2,51,null,-5,-5.9850000000000003,35.664999999999999,2.941230800035919E-2,51,null,-5,-3.7250000000000001,18.684999999999999,4.7257090840845568E-2,51,null,-5,-3.29,22.35,5.350536880916406E-2,51,null,-5,-5.3849999999999998,25.924999999999997,3.2689445382014806E-2,51,null,-5,-3.9649999999999999,43.155000000000001,4.4396636414161354E-2,51,null,-5,-19.975000000000001,165.315,8.8126489803329044E-3,51]
[null,null,null,null,-4.5,-4.6844999999999999,29.715499999999999,3.4632753358467619E-2,52,null,-4.5,-5.3864999999999998,36.263500000000001,3.0119211567389136E-2,52,null,-4.5,-3.3525,19.057500000000001,4.83928808673353E-2,52,null,-4.5,-2.9609999999999999,22.679000000000002,5.4791331681101521E-2,52,null,-4.5,-4.8464999999999998,26.4635,3.3475112577683194E-2,52,null,-4.5,-3.5685000000000002,43.551499999999997,4.5463677485705921E-2,52,null,-4.5,-17.977499999999999,167.3125,9.024454629828484E-3,52]
[null,null,null,null,-4,-4.1639999999999997,30.235999999999997,3.5376574476784182E-2,53,null,-4,-4.7880000000000003,36.861999999999995,3.0766093592591751E-2,53,null,-4,-2.98,19.43,4.943223359776152E-2,53,null,-4,-2.6320000000000001,23.007999999999999,5.5968106429076493E-2,53,null,-4,-4.3079999999999998,27.001999999999999,3.4194070594551838E-2,53,null,-4,-3.1719999999999997,43.948,4.644011857545062E-2,53,null,-4,-15.98,169.31,9.2182763530243642E-3,53]
[null,null,null,null,-3.5,-3.6435000000000004,30.756499999999999,3.604614283544072E-2,54,null,-3.5,-4.1895000000000007,37.460499999999996,3.1348399909518612E-2,54,null,-3.5,-2.6074999999999999,19.802500000000002,5.0367831800931268E-2,54,null,-3.5,-2.3029999999999999,23.337,5.7027408346039192E-2,54,null,-3.5,-3.7694999999999999,27.540499999999998,3.4841257838155795E-2,54,null,-3.5,-2.7755000000000001,44.344499999999996,4.7319085361530629E-2,54,null,-3.5,-13.982500000000002,171.3075,9.392749609935868E-3,54]
[null,null,null,null,-3,-3.1230000000000002,31.276999999999997,3.6636677757975411E-2,55,null,-3,-3.5910000000000002,38.058999999999997,3.1861972887261829E-2,55,null,-3,-2.2350000000000003,20.175000000000001,5.1192995363828736E-2,55,null,-3,-1.9740000000000002,23.666,5.7961674082146517E-2,55,null,-3,-3.2310000000000003,28.078999999999997,3.5412053431803536E-2,55,null,-3,-2.379,44.741,4.8094302075728138E-2,55,null,-3,-11.985000000000001,173.30499999999998,9.5466286723535423E-3,55]
[null,null,null,null,-2.5,-2.6025,31.797499999999999,3.7143911316315968E-2,56,null,-2.5,-2.9925000000000002,38.657499999999999,3.2303100818951484E-2,56,null,-2.5,-1.8625,20.547499999999999,5.1901760644677747E-2,56,null,-2.5,-1.645,23.995000000000001,5.8764151489794719E-2,56,null,-2.5,-2.6924999999999999,28.6175,3.5902332107971148E-2,56,null,-2.5,-1.9824999999999999,45.137499999999996,4.8760166053322729E-2,56,null,-2.5,-9.9875000000000007,175.30249999999998,9.6788014218485395E-3,56]
[null,null,null,null,-2,-2.0819999999999999,32.317999999999998,3.7564139671033225E-2,57,null,-2,-2.3940000000000001,39.256,3.2668562571048949E-2,57,null,-2,-1.49,20.92,5.2488952211470596E-2,57,null,-2,-1.3160000000000001,24.324000000000002,5.9428980847333723E-2,57,null,-2,-2.1539999999999999,29.155999999999999,3.630851383244716E-2,57,null,-2,-1.5859999999999999,45.533999999999999,4.9311815129313485E-2,57,null,-2,-7.99,177.29999999999998,9.7883027277961415E-3,57]
[null,null,null,null,-1.5,-1.5615000000000001,32.838499999999996,3.7894268098740524E-2,58,null,-1.5,-1.7955000000000001,39.854500000000002,3.2955666742513698E-2,58,null,-1.5,-1.1175000000000002,21.2925,5.2950245759448178E-2,58,null,-1.5,-0.9870000000000001,24.652999999999999,5.9951266095423845E-2,58,null,-1.5,-1.6155000000000002,29.694499999999998,3.6627607326637786E-2,58,null,-1.5,-1.1895,45.930499999999995,4.9745186747526975E-2,58,null,-1.5,-5.9925000000000006,179.29749999999999,9.8743261804227506E-3,58]
[null,null,null,null,-1,-1.0409999999999999,33.359000000000002,3.8131848941115445E-2,59,null,-1,-1.1970000000000001,40.452999999999996,3.316228466808787E-2,59,null,-1,-0.745,21.664999999999999,5.3282221137853927E-2,59,null,-1,-0.65800000000000003,24.981999999999999,6.032713487492581E-2,59,null,-1,-1.077,30.232999999999997,3.6857246748097656E-2,59,null,-1,-0.79299999999999993,46.326999999999998,5.005706777768118E-2,59,null,-1,-3.9950000000000001,181.29499999999999,9.9362339793995433E-3,59]
[null,null,null,null,-0.5,-0.52049999999999996,33.8795,3.8275111824665135E-2,60,null,-0.5,-0.59850000000000003,41.051499999999997,3.3286876699646112E-2,60,null,-0.5,-0.3725,22.037500000000001,5.3482404576478397E-2,60,null,-0.5,-0.32900000000000001,25.311,6.0553786336590275E-2,60,null,-0.5,-0.53849999999999998,30.7715,3.6995720900163793E-2,60,null,-0.5,-0.39649999999999996,46.723499999999994,5.0245134185972762E-2,60,null,-0.5,-1.9975000000000001,183.29249999999999,9.9735648083795741E-3,60]
[null,null,null,null,0,0,34.4,3.832298562934032E-2,61,null,0,0,41.65,3.3328511311732055E-2,61,null,0,0,22.41,5.3549299382742645E-2,61,null,0,0,25.64,6.0629525896874266E-2,61,null,0,0,31.31,3.7041994466242595E-2,61,null,0,0,47.12,5.0307979874077265E-2,61,null,0,0,185.29,9.9860395594851738E-3,61]
[null,null,null,null,0.5,0.52049999999999996,34.920499999999997,3.8275111824665135E-2,62,null,0.5,0.59850000000000003,42.2485,3.3286876699646112E-2,62,null,0.5,0.3725,22.782499999999999,5.3482404576478397E-2,62,null,0.5,0.32900000000000001,25.969000000000001,6.0553786336590275E-2,62,null,0.5,0.53849999999999998,31.848499999999998,3.6995720900163793E-2,62,null,0.5,0.39649999999999996,47.516500000000001,5.0245134185972762E-2,62,null,0.5,1.9975000000000001,187.28749999999999,9.9735648083795741E-3,62]
[null,null,null,null,1,1.0409999999999999,35.440999999999995,3.8131848941115445E-2,63,null,1,1.1970000000000001,42.847000000000001,3.316228466808787E-2,63,null,1,0.745,23.155000000000001,5.3282221137853927E-2,63,null,1,0.65800000000000003,26.298000000000002,6.032713487492581E-2,63,null,1,1.077,32.387,3.6857246748097656E-2,63,null,1,0.79299999999999993,47.912999999999997,5.005706777768118E-2,63,null,1,3.9950000000000001,189.285,9.9362339793995433E-3,63]
[null,null,null,null,1.5,1.5615000000000001,35.961500000000001,3.7894268098740524E-2,64,null,1.5,1.7955000000000001,43.445499999999996,3.2955666742513698E-2,64,null,1.5,1.1175000000000002,23.5275,5.2950245759448178E-2,64,null,1.5,0.9870000000000001,26.627000000000002,5.9951266095423845E-2,64,null,1.5,1.6155000000000002,32.9255,3.6627607326637786E-2,64,null,1.5,1.1895,48.3095,4.9745186747526975E-2,64,null,1.5,5.9925000000000006,191.2825,9.8743261804227506E-3,64]
[null,null,null,null,2,2.0819999999999999,36.481999999999999,{"$f":"NORMDIST(G343,F$276,F$277,FALSE)","v":3.7564139671033225E-2},65,null,2,2.3940000000000001,44.043999999999997,{"$f":"NORMDIST(M343,L$276,L$277,FALSE)","v":3.2668562571048949E-2},65,null,2,1.49,23.9,{"$f":"NORMDIST(S343,R$276,R$277,FALSE)","v":5.2488952211470596E-2},65,null,2,1.3160000000000001,26.956,{"$f":"NORMDIST(Y343,X$276,X$277,FALSE)","v":5.9428980847333723E-2},65,null,2,2.1539999999999999,33.463999999999999,{"$f":"NORMDIST(AE343,AD$276,AD$277,FALSE)","v":3.630851383244716E-2},65,null,2,1.5859999999999999,48.705999999999996,{"$f":"NORMDIST(AK343,AJ$276,AJ$277,FALSE)","v":4.9311815129313485E-2},65,null,2,7.99,193.28,{"$f":"NORMDIST(AQ343,AP$276,AP$277,FALSE)","v":9.7883027277961415E-3},65]
[null,null,null,null,2.5,{"$f":"E344*F$277/10","v":2.6025},{"$f":"F344+F$276","v":37.002499999999998},3.7143911316315968E-2,66,null,2.5,{"$f":"K344*L$277/10","v":2.9925000000000002},{"$f":"L344+L$276","v":44.642499999999998},3.2303100818951484E-2,66,null,2.5,{"$f":"Q344*R$277/10","v":1.8625},{"$f":"R344+R$276","v":24.272500000000001},5.1901760644677747E-2,66,null,2.5,{"$f":"W344*X$277/10","v":1.645},{"$f":"X344+X$276","v":27.285},5.8764151489794719E-2,66,null,2.5,{"$f":"AC344*AD$277/10","v":2.6924999999999999},{"$f":"AD344+AD$276","v":34.002499999999998},3.5902332107971148E-2,66,null,2.5,{"$f":"AI344*AJ$277/10","v":1.9824999999999999},{"$f":"AJ344+AJ$276","v":49.102499999999999},4.8760166053322729E-2,66,null,2.5,{"$f":"AO344*AP$277/10","v":9.9875000000000007},{"$f":"AP344+AP$276","v":195.2775},9.6788014218485395E-3,66]
[null,null,null,null,{"$f":"E344+0.5","v":3},3.1230000000000002,37.522999999999996,3.6636677757975418E-2,67,null,{"$f":"K344+0.5","v":3},3.5910000000000002,45.241,3.1861972887261829E-2,67,null,{"$f":"Q344+0.5","v":3},2.2350000000000003,24.645,5.1192995363828736E-2,67,null,{"$f":"W344+0.5","v":3},1.9740000000000002,27.614000000000001,5.7961674082146517E-2,67,null,{"$f":"AC344+0.5","v":3},3.2310000000000003,34.540999999999997,3.5412053431803543E-2,67,null,{"$f":"AI344+0.5","v":3},2.379,49.498999999999995,4.8094302075728138E-2,67,null,{"$f":"AO344+0.5","v":3},11.985000000000001,197.27500000000001,9.5466286723535423E-3,67]
[null,null,null,null,{"$f":"E345+0.5","v":3.5},3.6435000000000004,38.043500000000002,3.604614283544072E-2,68,null,{"$f":"K345+0.5","v":3.5},4.1895000000000007,45.839500000000001,3.1348399909518612E-2,68,null,{"$f":"Q345+0.5","v":3.5},2.6074999999999999,25.017499999999998,5.0367831800931268E-2,68,null,{"$f":"W345+0.5","v":3.5},2.3029999999999999,27.943000000000001,5.7027408346039192E-2,68,null,{"$f":"AC345+0.5","v":3.5},3.7694999999999999,35.079499999999996,3.4841257838155802E-2,68,null,{"$f":"AI345+0.5","v":3.5},2.7755000000000001,49.895499999999998,4.7319085361530629E-2,68,null,{"$f":"AO345+0.5","v":3.5},13.982500000000002,199.27249999999998,9.392749609935868E-3,68]
[null,null,null,null,{"$f":"E346+0.5","v":4},4.1639999999999997,38.564,3.5376574476784182E-2,69,null,{"$f":"K346+0.5","v":4},4.7880000000000003,46.438000000000002,3.0766093592591751E-2,69,null,{"$f":"Q346+0.5","v":4},2.98,25.39,4.943223359776152E-2,69,null,{"$f":"W346+0.5","v":4},2.6320000000000001,28.272000000000002,5.5968106429076493E-2,69,null,{"$f":"AC346+0.5","v":4},4.3079999999999998,35.617999999999995,3.4194070594551845E-2,69,null,{"$f":"AI346+0.5","v":4},3.1719999999999997,50.291999999999994,4.644011857545062E-2,69,null,{"$f":"AO346+0.5","v":4},15.98,201.26999999999998,9.2182763530243642E-3,69]
[null,null,null,null,{"$f":"E347+0.5","v":4.5},4.6844999999999999,39.084499999999998,3.4632753358467619E-2,70,null,{"$f":"K347+0.5","v":4.5},5.3864999999999998,47.036499999999997,3.0119211567389136E-2,70,null,{"$f":"Q347+0.5","v":4.5},3.3525,25.762499999999999,4.83928808673353E-2,70,null,{"$f":"W347+0.5","v":4.5},2.9609999999999999,28.600999999999999,5.4791331681101521E-2,70,null,{"$f":"AC347+0.5","v":4.5},4.8464999999999998,36.156500000000001,3.3475112577683187E-2,70,null,{"$f":"AI347+0.5","v":4.5},3.5685000000000002,50.688499999999998,4.5463677485705921E-2,70,null,{"$f":"AO347+0.5","v":4.5},17.977499999999999,203.26749999999998,9.024454629828484E-3,70]
[null,null,null,null,5,5.2050000000000001,39.604999999999997,3.3819916115686792E-2,71,null,5,5.9850000000000003,47.634999999999998,2.941230800035919E-2,71,null,5,3.7250000000000001,26.135000000000002,4.7257090840845568E-2,71,null,5,3.29,28.93,5.350536880916406E-2,71,null,5,5.3849999999999998,36.695,3.2689445382014806E-2,71,null,5,3.9649999999999999,51.084999999999994,4.4396636414161354E-2,71,null,5,19.975000000000001,205.26499999999999,8.8126489803329044E-3,71]
[null,null,null,null,5.5,5.7255000000000003,40.125500000000002,3.2943694046050319E-2,72,null,5.5,6.5835000000000008,48.233499999999999,2.8650280285662813E-2,72,null,5.5,4.0975000000000001,26.5075,4.6032732217366965E-2,72,null,5.5,3.6189999999999998,29.259,5.2119126902641935E-2,72,null,5.5,5.9234999999999998,37.233499999999999,3.1842512072366193E-2,72,null,5.5,4.3614999999999995,51.481499999999997,4.3246387770414112E-2,72,null,5.5,21.972500000000004,207.26249999999999,8.5843267839645545E-3,72]
[null,null,null,null,6,6.2460000000000004,40.646000000000001,3.2010048308530221E-2,73,null,6,7.1820000000000004,48.832000000000001,2.7838312689373399E-2,73,null,6,4.4700000000000006,26.880000000000003,4.472813461634894E-2,73,null,6,3.9480000000000004,29.588000000000001,5.0642036913647367E-2,73,null,6,6.4620000000000006,37.771999999999998,3.0940074548913617E-2,73,null,6,4.758,51.878,4.2020756985094526E-2,73,null,6,23.970000000000002,209.26,8.3410413740125054E-3,73]
[null,null,null,null,6.5,6.7665000000000006,41.166499999999999,3.1025202657820779E-2,74,null,6.5,7.7805000000000009,49.430500000000002,2.6981817850285233E-2,74,null,6.5,4.8425000000000002,27.252500000000001,4.3351994586297217E-2,74,null,6.5,4.2770000000000001,29.917000000000002,4.9083945238284847E-2,74,null,6.5,7.0004999999999997,38.310499999999998,2.9988148529982762E-2,74,null,6.5,5.1545000000000005,52.274499999999996,4.0727914207807608E-2,74,null,6.5,25.967500000000001,211.25749999999999,8.0844145098351496E-3,74]
[null,null,null,null,7,7.2870000000000008,41.686999999999998,2.9995574771062569E-2,75,null,7,8.3790000000000013,50.028999999999996,2.6086377056538126E-2,75,null,7,5.2149999999999999,27.625,4.1913279646545135E-2,75,null,7,4.6059999999999999,30.246000000000002,4.7455005070936356E-2,75,null,7,7.5389999999999997,38.848999999999997,2.8992937174258247E-2,75,null,7,5.5510000000000002,52.670999999999999,3.9376284157220838E-2,75,null,7,27.965000000000003,213.255,7.8161184822718704E-3,75]
[null,null,null,null,7.5,7.8075000000000001,42.207499999999996,2.8927707219481697E-2,76,null,7.5,8.9775000000000009,50.627499999999998,2.5157680213433953E-2,76,null,7.5,5.5875000000000004,27.997500000000002,4.0421131832859648E-2,76,null,7.5,4.9350000000000005,30.575000000000003,4.5765567196778774E-2,76,null,7.5,8.0774999999999988,39.387499999999996,2.7960764359777575E-2,76,null,7.5,5.9474999999999998,53.067499999999995,3.7974455505019482E-2,76,null,7.5,29.962499999999999,215.2525,7.5378581265282693E-3,76]
[null,null,null,null,8,8.3279999999999994,42.727999999999994,2.7828199112534379E-2,77,null,8,9.5760000000000005,51.225999999999999,2.4201466396113844E-2,77,null,8,5.96,28.37,3.8884772182749362E-2,77,null,8,5.2640000000000002,30.904,4.4026071848249658E-2,77,null,8,8.6159999999999997,39.926000000000002,2.6898008612951042E-2,77,null,8,6.3439999999999994,53.463999999999999,3.6531091142683825E-2,77,null,8,31.96,217.25,7.2513530102999426E-3,77]
[null,null,null,null,8.5,8.8484999999999996,43.2485,2.6703639397790243E-2,78,null,8.5,10.1745,51.8245,2.3223465842188505E-2,78,null,8.5,6.3325000000000005,28.7425,3.7313407534361943E-2,78,null,8.5,5.593,31.233000000000001,4.22469431810025E-2,78,null,8.5,9.1545000000000005,40.464500000000001,2.5811038637975531E-2,78,null,8.5,6.7404999999999999,53.860499999999995,3.5054840621815457E-2,78,null,8.5,33.957500000000003,219.2475,6.9583200533415877E-3,78]
[null,null,null,null,9,9.3689999999999998,43.768999999999998,2.5560542737632554E-2,79,null,9,10.773,52.423000000000002,2.2229344185359632E-2,79,null,9,6.7050000000000001,29.115000000000002,3.5716140926007348E-2,79,null,9,5.9219999999999997,31.562000000000001,4.0438487826558477E-2,79,null,9,9.6929999999999996,41.003,2.4706151336931735E-2,79,null,9,7.1370000000000005,54.256999999999998,3.3554255977144364E-2,79,null,9,35.954999999999998,221.245,6.6604568184919846E-3,79]
[null,null,null,null,9.5,9.8895,44.289499999999997,2.440528880587791E-2,80,null,9.5,11.371500000000001,53.021500000000003,2.1224649663257218E-2,80,null,9.5,7.0775000000000006,29.487500000000001,3.4101886774387781E-2,80,null,9.5,6.2509999999999994,31.890999999999998,3.8610798855499867E-2,80,null,9.5,10.2315,41.541499999999999,2.3589513135486444E-2,80,null,9.5,7.5334999999999992,54.653499999999994,3.2037712038989807E-2,80,null,9.5,37.952500000000001,223.24250000000001,6.3594256938470321E-3,80]
[null,null,null,null,10,10.41,44.81,2.3244065755921542E-2,81,null,10,11.97,53.62,2.021476395314481E-2,81,null,10,7.45,29.86,3.2479291881764218E-2,81,null,10,6.58,32.22,3.6773666340295351E-2,81,null,10,10.77,42.08,2.2467105340681835E-2,81,null,10,7.93,55.05,3.0513332221833965E-2,81,null,10,39.950000000000003,225.24,6.0568391619309951E-3,81]
[null,null,null,null,10.5,10.9305,45.330500000000001,2.2082818509532465E-2,82,null,10.5,12.5685,54.218499999999999,1.9204857200019465E-2,82,null,10.5,7.8225000000000007,30.232500000000002,3.0856663179091675E-2,82,null,10.5,6.9090000000000007,32.548999999999999,3.4936495544716277E-2,82,null,10.5,11.308499999999999,42.618499999999997,2.1344674158238913E-2,82,null,10.5,8.3264999999999993,55.4465,2.8988920641139084E-2,82,null,10.5,41.947500000000005,227.23750000000001,5.7542463250120877E-3,82]
[null,null,null,null,11,11.451000000000001,45.850999999999999,2.0927202404663836E-2,83,null,11,13.167000000000002,54.817,1.819984770530915E-2,83,null,11,8.1950000000000003,30.605,2.9241902957389335E-2,83,null,11,7.2379999999999995,32.878,3.3108233591573041E-2,83,null,11,11.847,43.156999999999996,2.0227685889744714E-2,83,null,11,8.722999999999999,55.842999999999996,2.7471901265138789E-2,83,null,11,43.945000000000007,229.23500000000001,5.4531208268473186E-3,83]
[null,null,null,null,11.5,11.971500000000001,46.371499999999997,1.9782542624397194E-2,84,null,11.5,13.765499999999999,55.415499999999994,1.720436664327275E-2,84,null,11.5,8.567499999999999,30.977499999999999,2.7642452177177822E-2,84,null,11.5,7.5670000000000002,33.207000000000001,3.1297305276591907E-2,84,null,11.5,12.385499999999999,43.695499999999996,1.9121287717732111E-2,84,null,11.5,9.1194999999999986,56.239499999999992,2.5969264655734542E-2,84,null,11.5,45.942500000000003,231.23249999999999,5.1548502808504322E-3,84]
[null,null,null,null,{"$f":"E362+0.5","v":12},12.492000000000001,46.891999999999996,1.8653799710202982E-2,85,null,{"$f":"K362+0.5","v":12},14.364000000000001,56.013999999999996,1.6222728068773017E-2,85,null,{"$f":"Q362+0.5","v":12},8.9400000000000013,31.35,2.6065242279625894E-2,85,null,{"$f":"W362+0.5","v":12},7.8960000000000008,33.536000000000001,2.9511558508087073E-2,85,null,{"$f":"AC362+0.5","v":12},12.924000000000001,44.234000000000002,1.8030274371700357E-2,85,null,{"$f":"AI362+0.5","v":12},9.516,56.635999999999996,2.448752269649597E-2,85,null,{"$f":"AO362+0.5","v":12},47.940000000000005,233.23,4.8607272836849302E-3,85]
[null,null,null,null,{"$f":"E363+0.5","v":12.5},13.012499999999999,47.412499999999994,1.7545541343806148E-2,86,null,{"$f":"K363+0.5","v":12.5},14.9625,56.612499999999997,1.5258904376693564E-2,86,null,{"$f":"Q363+0.5","v":12.5},9.3125,31.7225,2.4516655756915695E-2,86,null,{"$f":"W363+0.5","v":12.5},8.2249999999999996,33.865000000000002,2.775821966398509E-2,86,null,{"$f":"AC363+0.5","v":12.5},13.4625,44.772500000000001,1.6959060853205376E-2,86,null,{"$f":"AI363+0.5","v":12.5},9.9124999999999996,57.032499999999999,2.3032671549687501E-2,86,null,{"$f":"AO363+0.5","v":12.5},49.937500000000007,235.22749999999999,4.571942062303427E-3,86]
[null,null,null,null,13,13.533000000000001,47.933,1.6461920465687545E-2,87,null,13,15.561000000000002,57.210999999999999,1.4316507272164361E-2,87,null,13,9.6850000000000005,32.094999999999999,2.3002495576886901E-2,87,null,13,8.5540000000000003,34.194000000000003,2.6043858973830901E-2,87,null,13,14.000999999999999,45.311,1.5911661285775983E-2,87,null,13,10.309000000000001,57.429000000000002,2.1610162931627642E-2,87,null,13,51.935000000000002,237.22499999999999,4.289576772160384E-3,87]
[null,null,null,null,13.5,14.0535,48.453499999999998,1.5406659687023979E-2,88,null,13.5,16.159500000000001,57.8095,1.339877421402837E-2,88,null,13.5,10.057500000000001,32.467500000000001,2.1527963401599945E-2,88,null,13.5,8.8829999999999991,34.522999999999996,2.4374365857434615E-2,88,null,13.5,14.539499999999999,45.849499999999999,1.4891673847903398E-2,88,null,13.5,10.705499999999999,57.825499999999998,2.0224883649674601E-2,88,null,13.5,53.932500000000005,239.2225,4.0146014353421673E-3,88]
[null,null,null,null,14,14.574000000000002,48.974000000000004,1.4383041847814096E-2,89,null,14,16.758000000000003,58.408000000000001,1.2508560203487453E-2,89,null,14,10.43,32.840000000000003,2.0097646394059702E-2,89,null,14,9.2119999999999997,34.852000000000004,2.2754933987195247E-2,89,null,14,15.077999999999999,46.387999999999998,1.3902271646772969E-2,89,null,14,11.102,58.221999999999994,1.8881143207534042E-2,89,null,14,55.930000000000007,241.22,3.7478714802439256E-3,89]
[null,null,null,null,14.5,15.0945,49.494500000000002,1.3393906478901072E-2,90,null,14.5,17.3565,59.006500000000003,1.1648334707214722E-2,90,null,14.5,10.8025,33.212499999999999,1.8715512274545008E-2,90,null,14.5,9.5410000000000004,35.180999999999997,2.1190055690784249E-2,90,null,14.5,15.616499999999998,46.926499999999997,1.2946199298547843E-2,90,null,14.5,11.4985,58.618499999999997,1.7582669160827274E-2,90,null,14.5,57.927500000000009,243.2175,3.4901268196585789E-3,90]
[null,null,null,null,15,15.615,50.015000000000001,1.2441651841103907E-2,91,null,15,17.955000000000002,59.605000000000004,1.0820183430734473E-2,91,null,15,11.175000000000001,33.585000000000001,1.7384912169918356E-2,91,null,15,9.870000000000001,35.510000000000005,1.9683525177187178E-2,91,null,15,16.154999999999998,47.464999999999996,1.2025774899339998E-2,91,null,15,11.895,59.015000000000001,1.6332609793933372E-2,91,null,15,59.924999999999997,245.21499999999997,3.2419923821249519E-3,91]
[null,null,null,null,15.5,16.1355,50.535499999999999,1.1528242141881419E-2,92,null,15.5,18.5535,60.203499999999998,1.0025814594568559E-2,92,null,15.5,11.547500000000001,33.957500000000003,1.6108590697581953E-2,92,null,15.5,10.199,35.838999999999999,1.8238449953949191E-2,92,null,15.5,16.6935,48.003500000000003,1.1142897000648608E-2,92,null,15.5,12.291499999999999,59.411499999999997,1.513354359356691E-2,92,null,15.5,61.922499999999999,247.21249999999998,3.0039799924151604E-3,92]
[null,null,null,null,16,16.655999999999999,51.055999999999997,1.0655219469688337E-2,93,null,16,19.152000000000001,60.802,9.2665693132377228E-3,93,null,16,11.92,34.33,1.4888702641537667E-2,93,null,16,10.528,36.167999999999999,1.6857269708123949E-2,93,null,16,17.231999999999999,48.542000000000002,1.0299056144796242E-2,93,null,16,12.687999999999999,59.807999999999993,1.3987494915442074E-2,93,null,16,63.92,249.20999999999998,2.776491481338063E-3,93]
[null,null,null,null,16.5,17.176500000000001,51.576499999999996,9.8237199389027922E-3,94,null,16.5,19.750500000000002,61.400500000000001,8.5434356360883871E-3,94,null,16.5,12.2925,34.702500000000001,1.3726835511943359E-2,94,null,16.5,10.857000000000001,36.497,1.554178184862888E-2,94,null,16.5,17.770499999999998,49.080500000000001,9.4953504701929415E-3,94,null,16.5,13.0845,60.204499999999996,1.2895955178307444E-2,94,null,16.5,65.917500000000004,251.20749999999998,2.5598228927153459E-3,94]
[null,null,null,null,17,17.696999999999999,52.096999999999994,9.0344935040237283E-3,95,null,17,20.349,61.998999999999995,7.8570657791885521E-3,95,null,17,12.665000000000001,35.075000000000003,1.2624037231796894E-2,95,null,17,11.186,36.826000000000001,1.4293172853630234E-2,95,null,17,18.309000000000001,49.619,8.7325048632206984E-3,95,null,17,13.481,60.600999999999999,1.1859908874765058E-2,95,null,17,67.915000000000006,253.20499999999998,2.3541696464802744E-3,95]
[null,null,null,null,17.5,18.217500000000001,52.6175,8.2879268805486576E-3,96,null,17.5,20.947500000000002,62.597499999999997,7.207796059023522E-3,96,null,17.5,13.0375,35.447499999999998,1.1580848164632424E-2,96,null,17.5,11.515000000000001,37.155000000000001,1.3112054532904488E-2,96,null,17.5,18.8475,50.157499999999999,8.0108931129537174E-3,96,null,17.5,13.877500000000001,60.997500000000002,1.087986366034192E-2,96,null,17.5,69.912499999999994,255.20249999999999,2.159632511301916E-3,96]
[null,null,null,null,18,18.738,53.137999999999998,{"$f":"NORMDIST(G375,F$276,F$277,FALSE)","v":7.5840690010465115E-3},97,null,18,21.545999999999999,63.195999999999998,{"$f":"NORMDIST(M375,L$276,L$277,FALSE)","v":6.5956690309853117E-3},97,null,18,13.41,35.82,{"$f":"NORMDIST(S375,R$276,R$277,FALSE)","v":1.0597336684683779E-2},97,null,18,11.843999999999999,37.484000000000002,{"$f":"NORMDIST(Y375,X$276,X$277,FALSE)","v":1.1998504301047739E-2},97,null,18,19.385999999999999,50.695999999999998,{"$f":"NORMDIST(AE375,AD$276,AD$277,FALSE)","v":7.3305625163318624E-3},97,null,18,14.274000000000001,61.393999999999998,{"$f":"NORMDIST(AK375,AJ$276,AJ$277,FALSE)","v":9.9558837706045546E-3},97,null,18,71.91,257.2,{"$f":"NORMDIST(AQ375,AP$276,AP$277,FALSE)","v":1.976224237819629E-3},97]
[null,null,null,null,18.5,19.258500000000002,53.658500000000004,6.9226584376770334E-3,98,null,18.5,22.144500000000001,63.794499999999999,6.0204573380299095E-3,98,null,18.5,13.782500000000002,36.192500000000003,9.6731374947943566E-3,98,null,18.5,12.173,37.813000000000002,1.0952108561735251E-2,98,null,18.5,19.924500000000002,51.234499999999997,6.691260384049956E-3,98,null,18.5,14.670499999999999,61.790499999999994,9.0876260196996288E-3,98,null,18.5,73.907499999999999,259.19749999999999,1.8038767042858077E-3,98]
[null,null,null,null,19,19.779,54.179000000000002,6.3031522357998608E-3,99,null,19,22.743000000000002,64.393000000000001,5.4816887865226883E-3,99,null,19,14.155000000000001,36.564999999999998,8.807491916063977E-3,99,null,19,12.501999999999999,38.141999999999996,9.9720083244189493E-3,99,null,19,20.463000000000001,51.772999999999996,6.0924619103692292E-3,99,null,19,15.066999999999998,62.186999999999998,8.2743776512833028E-3,99,null,19,75.905000000000001,261.19499999999999,1.6424484299042952E-3,99]
[null,null,null,null,19.5,20.299500000000002,54.6995,5.7247556262071128E-3,100,null,19.5,23.341500000000003,64.991500000000002,4.9786721862001716E-3,100,null,19.5,14.5275,36.9375,7.9992894052102123E-3,100,null,19.5,12.831,38.471000000000004,9.0569462110662666E-3,100,null,19.5,21.0015,52.311499999999995,5.5333988921834826E-3,100,null,19.5,15.4635,62.583500000000001,7.515095342851958E-3,100,null,19.5,77.902500000000003,263.1925,1.4917323171167978E-3,100]
[null,null,null,null,20,20.82,55.22,5.1864521146194097E-3,101,null,20,23.94,65.59,4.5105235182279031E-3,101,null,20,14.9,37.31,7.2471095990856368E-3,101,null,20,13.16,38.799999999999997,8.2053140597550308E-3,101,null,20,21.54,52.849999999999994,5.0130888127379843E-3,101,null,20,15.86,62.98,6.8084447053200579E-3,101,null,20,79.900000000000006,265.19,1.3514634921949452E-3,101]
[null,null,null,null,20.5,21.340499999999999,55.740499999999997,4.6870334850319662E-3,102,null,20.5,24.538500000000003,66.188500000000005,4.0761920283360663E-3,102,null,20.5,15.272499999999999,37.682499999999997,6.5492642388164874E-3,102,null,20.5,13.489000000000001,39.129000000000005,7.4152003919730515E-3,102,null,20.5,22.078499999999998,53.388499999999993,4.5303638420782577E-3,102,null,20.5,16.256499999999999,63.376499999999993,6.1528396695060316E-3,102,null,20.5,81.897500000000008,267.1875,1.2213271233837977E-3,102]
[null,null,null,null,21,21.861000000000001,56.260999999999996,4.2251292968710115E-3,103,null,21,25.137,66.787000000000006,3.6744858797349332E-3,103,null,21,15.645000000000001,38.055,5.9038383866345219E-3,103,null,21,13.818000000000001,39.457999999999998,6.6844370790922836E-3,103,null,21,22.616999999999997,53.926999999999992,4.0838993482290838E-3,103,null,21,16.652999999999999,63.772999999999996,5.5464812081244879E-3,103,null,21,83.89500000000001,269.185,1.1009661071446106E-3,103]
[null,null,null,null,21.5,22.381499999999999,56.781499999999994,3.7992355033016579E-3,104,null,21.5,25.735500000000002,67.385500000000008,3.3040970417184757E-3,104,null,21.5,16.017500000000002,38.427500000000002,5.3087304146805618E-3,104,null,21.5,14.147,39.786999999999999,6.0106446184453226E-3,104,null,21.5,23.155499999999996,54.465499999999992,3.6722415589016031E-3,104,null,21.5,17.049500000000002,64.169499999999999,4.9873949040819916E-3,104,null,21.5,85.892500000000013,271.1825,9.8998852539099332E-4,104]
[null,null,null,null,22,22.902000000000001,57.302,3.4077418680337583E-3,105,null,22,26.334000000000003,67.984000000000009,2.9636251333526641E-3,105,null,22,16.39,38.799999999999997,4.7616903149303967E-3,105,null,22,14.475999999999999,40.116,5.391275508545814E-3,105,null,22,23.693999999999999,55.003999999999998,3.293834061859928E-3,105,null,22,17.445999999999998,64.566000000000003,4.4734669415171999E-3,105,null,22,87.890000000000015,273.18,8.8797478964283911E-4,105]
[null,null,null,null,22.5,23.422499999999999,57.822499999999998,3.0489579092860155E-3,106,null,22.5,26.932499999999997,68.582499999999996,2.6515999862712987E-3,106,null,22.5,16.762499999999999,39.172499999999999,4.2603559510962976E-3,106,null,22.5,14.805000000000001,40.445,4.8236552941743798E-3,106,null,22.5,24.232499999999998,55.542499999999997,2.947042881677569E-3,106,null,22.5,17.842499999999998,64.962499999999991,4.0024781633880803E-3,106,null,22.5,89.887500000000017,275.17750000000001,7.9448440139342656E-4,106]
[null,null,null,null,23,23.943000000000001,58.343000000000004,2.7211371509703319E-3,107,null,23,27.530999999999999,69.180999999999997,2.3665027353050282E-3,107,null,23,17.134999999999998,39.545000000000002,3.8022869451813635E-3,107,null,23,15.134,40.774000000000001,4.3050209333740401E-3,107,null,23,24.770999999999997,56.080999999999996,2.6301799202972319E-3,107,null,23,18.238999999999997,65.358999999999995,3.5721359068853955E-3,107,null,23,91.885000000000005,277.17500000000001,7.0906227137925294E-4,107]
[null,null,null,null,23.5,24.4635,58.863500000000002,2.4224995115460501E-3,108,null,23.5,28.1295,69.779499999999999,2.1067852894899233E-3,108,null,23.5,17.5075,39.917500000000004,3.3849959617710552E-3,108,null,23.5,15.462999999999999,41.103000000000002,3.8325562181146479E-3,108,null,23.5,25.3095,56.619500000000002,2.3415245975110825E-3,108,null,23.5,18.6355,65.755499999999998,3.1801033940976522E-3,108,null,23.5,93.882500000000007,279.17250000000001,6.3124455357182368E-4,108]
[null,null,null,null,24,24.984000000000002,59.384,2.1512517093989318E-3,109,null,24,28.728000000000002,70.378,1.8708880780988219E-3,109,null,24,17.880000000000003,40.290000000000006,3.0059772207842749E-3,109,null,24,15.792000000000002,41.432000000000002,3.4034240569670031E-3,109,null,24,25.848000000000003,57.158000000000001,2.0793435742658202E-3,109,null,24,19.032,66.152000000000001,2.8240265188956976E-3,109,null,24,95.88000000000001,281.17,5.6056396232397694E-4,109]
[null,null,null,null,24.5,25.5045,59.904499999999999,1.9056056092022395E-3,110,null,24.5,29.326500000000003,70.976500000000001,1.6572560059979376E-3,110,null,24.5,18.252500000000001,40.662500000000001,2.6627321331268872E-3,110,null,24.5,16.121000000000002,41.761000000000003,3.0147955002728438E-3,110,null,24.5,26.386500000000002,57.6965,1.8419084857748667E-3,110,null,24.5,19.4285,66.54849999999999,2.5015579308695283E-3,110,null,24.5,97.877500000000012,283.16750000000002,4.9655455298611498E-4,110]
[null,null,null,null,25,26.024999999999999,60.424999999999997,1.6837944758471219E-3,111,null,25,29.925000000000001,71.575000000000003,1.4643525892705533E-3,111,null,25,18.625,41.034999999999997,2.3527920125595374E-3,111,null,25,16.45,42.09,2.6638754549496236E-3,111,null,25,26.925000000000001,58.234999999999999,1.6275116521419256E-3,111,null,25,19.824999999999999,66.944999999999993,2.210378372455051E-3,111,null,25,99.875000000000014,285.16500000000002,4.3875595728582037E-4,111]
[null,null,null,null,25.5,26.545499999999997,60.945499999999996,1.4840871406719667E-3,112,null,25.5,30.523500000000002,72.173500000000004,1.2906722752209824E-3,112,null,25.5,18.997499999999999,41.407499999999999,2.0737378703886136E-3,112,null,25.5,16.779,42.418999999999997,2.3479250964126438E-3,112,null,25.5,27.4635,58.773499999999999,1.4344797710673315E-3,112,null,25.5,20.221499999999999,67.341499999999996,1.9482152754596691E-3,112,null,25.5,101.8725,287.16250000000002,3.8671707470325754E-4,112]
[null,null,null,null,26,27.066000000000003,61.466000000000001,1.304800118509665E-3,113,null,26,31.122000000000003,72.772000000000006,1.1347509802577779E-3,113,null,26,19.37,41.78,1.823217346803438E-3,113,null,26,17.108000000000001,42.748000000000005,2.064281038554043E-3,113,null,26,28.001999999999999,59.311999999999998,1.2611856298686734E-3,113,null,26,20.618000000000002,67.738,1.7128586675517787E-3,113,null,26,103.87,289.15999999999997,3.3999922987949045E-4,113]
[null,null,null,null,26.5,27.586500000000001,61.986499999999999,1.1443077432858001E-3,114,null,26.5,31.720500000000005,73.370500000000007,9.951749045618353E-4,114,null,26.5,19.7425,42.152500000000003,1.5989588735040496E-3,114,null,26.5,17.437000000000001,43.076999999999998,1.8103713689369598E-3,114,null,26.5,28.540499999999998,59.850499999999997,1.1060579022846035E-3,114,null,26.5,21.014499999999998,68.134500000000003,1.5021744776299059E-3,114,null,26.5,105.86750000000002,291.15750000000003,2.9817881370726288E-4,114]
[null,null,null,null,27,28.106999999999999,62.506999999999998,1.0010504144498181E-3,115,null,27,32.319000000000003,73.968999999999994,8.7058770379470462E-4,115,null,27,20.115000000000002,42.525000000000006,1.3987831965667889E-3,115,null,27,17.765999999999998,43.405999999999999,1.5837286952010035E-3,115,null,27,29.078999999999997,60.388999999999996,9.6758911925929486E-4,115,null,27,21.410999999999998,68.530999999999992,1.3141153612134444E-3,115,null,27,107.86500000000001,293.15499999999997,2.6084943215075378E-4,115]
[null,null,null,null,27.5,28.627499999999998,63.027499999999996,8.7354106643526086E-4,116,null,27.5,32.917500000000004,74.567499999999995,7.5969611542114164E-4,116,null,27.5,20.487500000000001,42.897500000000001,1.2206124163209467E-3,116,null,27.5,18.094999999999999,43.734999999999999,1.382000380181011E-3,116,null,27.5,29.6175,60.927499999999995,8.4434192215330226E-4,116,null,27.5,21.807499999999997,68.927499999999995,1.146729193138848E-3,116,null,27.5,109.8625,295.15249999999997,2.2762359202981388E-4,116]
[null,null,null,null,28,29.148000000000003,63.548000000000002,7.6036998875888163E-4,117,null,28,33.516000000000005,75.165999999999997,6.6127415062489287E-4,117,null,28,20.86,43.269999999999996,1.0624767225476479E-3,117,null,28,18.423999999999999,44.064,1.202956167626135E-3,117,null,28,30.155999999999999,61.465999999999994,7.3495372172515956E-4,117,null,28,22.204000000000001,69.323999999999998,9.9816539507943973E-4,117,null,28,111.86000000000001,297.14999999999998,1.9813395702077539E-4,117]
[null,null,null,null,28.5,29.668500000000002,64.0685,6.6020813550566487E-4,118,null,28.5,34.114500000000007,75.764499999999998,5.7416597248237074E-4,118,null,28.5,21.232500000000002,43.642499999999998,9.2251901887435933E-4,118,null,28.5,18.753,44.393000000000001,1.0444934180264393E-3,118,null,28.5,30.694499999999998,62.004499999999993,6.3813989699294132E-4,118,null,28.5,22.6005,69.720500000000001,8.6667928002698183E-4,118,null,28.5,113.8575,299.14749999999998,1.7203421002788427E-4,118]
[null,null,null,null,29,30.189,64.588999999999999,5.7180907010334809E-4,119,null,29,34.713000000000001,76.363,4.9728758728286157E-4,119,null,29,21.605,44.015000000000001,7.9899764023836967E-4,119,null,29,19.082000000000001,44.722000000000001,9.0464018537626952E-4,119,null,29,31.232999999999997,62.542999999999992,5.5269567500240149E-4,119,null,29,22.997,70.11699999999999,7.5063460526807939E-4,119,null,29,115.85500000000002,301.14499999999998,1.4899955994432702E-4,119]
[null,null,null,null,29.5,30.709500000000002,65.109499999999997,4.94009694817862E-4,120,null,29.5,35.311500000000002,76.961500000000001,4.2962747895187461E-4,120,null,29.5,21.977499999999999,44.387500000000003,6.9028737222200521E-4,120,null,29.5,19.411000000000001,45.051000000000002,7.8155637128479315E-4,120,null,29.5,31.771499999999996,63.081499999999991,4.7749683593815718E-4,120,null,29.5,23.3935,70.513499999999993,6.4850453001941285E-4,120,null,29.5,117.85250000000001,303.14249999999998,1.2872693174102484E-4,120]
[null,null,null,null,30,31.23,65.63,4.2572991469145199E-4,121,null,30,35.910000000000004,77.56,3.7024631678680091E-4,121,null,30,22.35,44.760000000000005,5.9487898146818783E-4,121,null,30,19.740000000000002,45.38,6.7353319330364732E-4,121,null,30,32.309999999999995,63.61999999999999,4.1149938829508067E-4,121,null,30,23.79,70.91,5.5887117426708802E-4,121,null,30,119.85,305.14,1.1093487889707172E-4,121]
[]
[]
[]
[]
[]
[]
[null,null,null,null,"Marque ","x","y",null,null,null,"Marque ","x","y",null,null,null,"Marque ","x","y",null,null,null,"Marque ","x","y",null,null,null,"Marque ","x","y",null,null,null,"Marque ","x","y",null,null,null,"Marque ","x","y"]
[null,null,null,null,"T1",{"$f":"VLOOKUP(F$274,G279:J399,3,TRUE)","v":62},{"$f":"VLOOKUP(F$274,G279:H399,2,TRUE)","v":3.8275111824665135E-2},null,null,null,"T1",{"$f":"VLOOKUP(L$274,M279:P399,3,TRUE)","v":58},{"$f":"VLOOKUP(L$274,M279:N399,2,TRUE)","v":3.2955666742513698E-2},null,null,null,"T1",{"$f":"VLOOKUP(R$274,S279:V399,3,TRUE)","v":33},{"$f":"VLOOKUP(R$274,S279:T399,2,TRUE)","v":2.0097646394059716E-2},null,null,null,"T1",{"$f":"VLOOKUP(X$274,Y279:AB399,3,TRUE)","v":49},{"$f":"VLOOKUP(X$274,Y279:Z399,2,TRUE)","v":5.0642036913647367E-2},null,null,null,"T1",{"$f":"VLOOKUP(AD$274,AE279:AH399,3,TRUE)","v":45},{"$f":"VLOOKUP(AD$274,AE279:AF399,2,TRUE)","v":2.6898008612951042E-2},null,null,null,"T1",{"$f":"VLOOKUP(AJ$274,AK279:AN399,3,TRUE)","v":65},{"$f":"VLOOKUP(AJ$274,AK279:AL399,2,TRUE)","v":4.9311815129313485E-2},null,null,null,"T1",{"$f":"VLOOKUP(AP$274,AQ279:AT399,3,TRUE)","v":48},{"$f":"VLOOKUP(AP$274,AQ279:AR399,2,TRUE)","v":8.0844145098351496E-3}]
[null,null,null,null,"T2",{"$f":"VLOOKUP(F$275,G279:J399,3,TRUE)","v":39},{"$f":"VLOOKUP(F$275,G279:H399,2,TRUE)","v":2.0927202404663836E-2},null,null,null,"T2",{"$f":"VLOOKUP(L$275,M279:P399,3,TRUE)","v":56},{"$f":"VLOOKUP(L$275,M279:N399,2,TRUE)","v":3.2303100818951484E-2},null,null,null,"T2",{"$f":"VLOOKUP(R$275,S279:V399,3,TRUE)","v":33},{"$f":"VLOOKUP(R$275,S279:T399,2,TRUE)","v":2.0097646394059716E-2},null,null,null,"T2",{"$f":"VLOOKUP(X$275,Y279:AB399,3,TRUE)","v":25},{"$f":"VLOOKUP(X$275,Y279:Z399,2,TRUE)","v":1.1998504301047748E-2},null,null,null,"T2",{"$f":"VLOOKUP(AD$275,AE279:AH399,3,TRUE)","v":43},{"$f":"VLOOKUP(AD$275,AE279:AF399,2,TRUE)","v":2.4706151336931735E-2},null,null,null,"T2",{"$f":"VLOOKUP(AJ$275,AK279:AN399,3,TRUE)","v":55},{"$f":"VLOOKUP(AJ$275,AK279:AL399,2,TRUE)","v":4.8094302075728138E-2},null,null,null,"T2",{"$f":"VLOOKUP(AP$275,AQ279:AT399,3,TRUE)","v":39},{"$f":"VLOOKUP(AP$275,AQ279:AR399,2,TRUE)","v":5.4531208268473186E-3}]
[]
[null,null,null,null,"Moyenne norme","x","y",null,null,null,"Moyenne norme","x","y",null,null,null,"Moyenne norme","x","y",null,null,null,"Moyenne norme","x","y",null,null,null,"Moyenne norme","x","y",null,null,null,"Moyenne norme","x","y",null,null,null,"Moyenne norme","x","y"]
[]
[]
[null,null,null,null,"Ecart sup","x","y",null,null,null,"Ecart sup","x","y",null,null,null,"Ecart sup","x","y",null,null,null,"Ecart sup","x","y",null,null,null,"Ecart sup","x","y",null,null,null,"Ecart sup","x","y",null,null,null,"Ecart sup","x","y"]
[null,null,null,null,null,71,0,null,null,null,null,71,0,null,null,null,null,71,0,null,null,null,null,71,0,null,null,null,null,71,0,null,null,null,null,71,0,null,null,null,null,71,0]
[null,null,null,null,null,71,{"$f":"VLOOKUP(5,E279:I399,4,TRUE)","v":3.3819916115686792E-2},null,null,null,null,71,{"$f":"VLOOKUP(5,K279:O399,4,TRUE)","v":2.941230800035919E-2},null,null,null,null,71,{"$f":"VLOOKUP(5,Q279:U399,4,TRUE)","v":4.7257090840845568E-2},null,null,null,null,71,{"$f":"VLOOKUP(5,W279:AA399,4,TRUE)","v":5.350536880916406E-2},null,null,null,null,71,{"$f":"VLOOKUP(5,AC279:AG399,4,TRUE)","v":3.2689445382014806E-2},null,null,null,null,71,{"$f":"VLOOKUP(5,AI279:AM399,4,TRUE)","v":4.4396636414161354E-2},null,null,null,null,71,{"$f":"VLOOKUP(5,AO279:AS399,4,TRUE)","v":8.8126489803329044E-3}]
[null,null,null,null,"Ecart inf","x","y",null,null,null,"Ecart inf","x","y",null,null,null,"Ecart inf","x","y",null,null,null,"Ecart inf","x","y",null,null,null,"Ecart inf","x","y",null,null,null,"Ecart inf","x","y",null,null,null,"Ecart inf","x","y"]
[null,null,null,null,null,51,0,null,null,null,null,51,0,null,null,null,null,51,0,null,null,null,null,51,0,null,null,null,null,51,0,null,null,null,null,51,0,null,null,null,null,51,0]
[null,null,null,null,null,51,{"$f":"VLOOKUP(-5,E279:I399,4,TRUE)","v":3.3819916115686792E-2},null,null,null,null,51,{"$f":"VLOOKUP(-5,K279:O399,4,TRUE)","v":2.941230800035919E-2},null,null,null,null,51,{"$f":"VLOOKUP(-5,Q279:U399,4,TRUE)","v":4.7257090840845568E-2},null,null,null,null,51,{"$f":"VLOOKUP(-5,W279:AA399,4,TRUE)","v":5.350536880916406E-2},null,null,null,null,51,{"$f":"VLOOKUP(-5,AC279:AG399,4,TRUE)","v":3.2689445382014806E-2},null,null,null,null,51,{"$f":"VLOOKUP(-5,AI279:AM399,4,TRUE)","v":4.4396636414161354E-2},null,null,null,null,51,{"$f":"VLOOKUP(-5,AO279:AS399,4,TRUE)","v":8.8126489803329044E-3}]
[null,null,null,null,"Ecart 2 sup","x","y",null,null,null,"Ecart 2 sup","x","y",null,null,null,"Ecart 2 sup","x","y",null,null,null,"Ecart 2 sup","x","y",null,null,null,"Ecart 2 sup","x","y",null,null,null,"Ecart 2 sup","x","y",null,null,null,"Ecart 2 sup","x","y"]
[null,null,null,null,null,91,0,null,null,null,null,91,0,null,null,null,null,91,0,null,null,null,null,91,0,null,null,null,null,91,0,null,null,null,null,91,0,null,null,null,null,91,0]
[null,null,null,null,null,91,{"$f":"VLOOKUP(15,E279:I399,4,TRUE)","v":1.2441651841103907E-2},null,null,null,null,91,{"$f":"VLOOKUP(15,K279:O399,4,TRUE)","v":1.0820183430734473E-2},null,null,null,null,91,{"$f":"VLOOKUP(15,Q279:U399,4,TRUE)","v":1.7384912169918356E-2},null,null,null,null,91,{"$f":"VLOOKUP(15,W279:AA399,4,TRUE)","v":1.9683525177187178E-2},null,null,null,null,91,{"$f":"VLOOKUP(15,AC279:AG399,4,TRUE)","v":1.2025774899339998E-2},null,null,null,null,91,{"$f":"VLOOKUP(15,AI279:AM399,4,TRUE)","v":1.6332609793933372E-2},null,null,null,null,91,{"$f":"VLOOKUP(15,AO279:AS399,4,TRUE)","v":3.2419923821249519E-3}]
[null,null,null,null,"Ecart 2 inf","x","y",null,null,null,"Ecart 2 inf","x","y",null,null,null,"Ecart 2 inf","x","y",null,null,null,"Ecart 2 inf","x","y",null,null,null,"Ecart 2 inf","x","y",null,null,null,"Ecart 2 inf","x","y",null,null,null,"Ecart 2 inf","x","y"]
[null,null,null,null,null,31,0,null,null,null,null,31,0,null,null,null,null,31,0,null,null,null,null,31,0,null,null,null,null,31,0,null,null,null,null,31,0,null,null,null,null,31,0]
[null,null,null,null,null,31,{"$f":"VLOOKUP(-15,E279:J399,4,TRUE)","v":1.2441651841103907E-2},null,null,null,null,31,{"$f":"VLOOKUP(-15,K279:P399,4,TRUE)","v":1.0820183430734482E-2},null,null,null,null,31,{"$f":"VLOOKUP(-15,Q279:V399,4,TRUE)","v":1.7384912169918356E-2},null,null,null,null,31,{"$f":"VLOOKUP(-15,W279:AB399,4,TRUE)","v":1.9683525177187185E-2},null,null,null,null,31,{"$f":"VLOOKUP(-15,AC279:AH399,4,TRUE)","v":1.2025774899339998E-2},null,null,null,null,31,{"$f":"VLOOKUP(-15,AI279:AN399,4,TRUE)","v":1.6332609793933372E-2},null,null,null,null,31,{"$f":"VLOOKUP(-15,AO279:AT399,4,TRUE)","v":3.2419923821249506E-3}]

{"sheet":"IUS","index":7,"n_rows":425,"n_cols":13,"rows_kept":425,"cut":false,"hidden":false,"merged":[[2,1,3,1],[2,2,3,2],[2,3,3,3],[2,4,3,4],[39,11,39,12],[2,5,3,5],[39,1,39,3],[39,4,39,6],[6,0,6,6],[7,0,7,6],[8,0,8,6],[9,0,9,6],[10,0,10,6],[11,0,11,6],[12,0,12,6],[13,0,13,6],[14,0,14,6],[15,0,15,6],[16,0,16,6],[17,0,17,6],[18,0,18,6],[19,0,19,6],[20,0,20,6],[21,0,21,6],[22,0,22,6],[23,0,23,6],[24,0,24,6],[25,0,25,6],[26,0,26,6],[27,0,27,6],[28,0,28,6],[29,0,29,6],[30,0,30,6],[31,0,31,6],[32,0,32,6],[33,0,33,6]]}
["Intolerance to Uncertainty Scale"]
[]
[null,"Not at all characteristic of me (1)","A few characteristic of me (2)","Somewhat characteristic of me (3)","Very characteristic of me (4)","Entirely characteristic of me (5)"]
[null,"Not at all characteristic of me","A few characteristic of me ","Somewhat characteristic of me","Very characteristic of me ","Entirely characteristic of me"]
[]
[]
["Item",null,null,null,null,null,null,"Score T1","Score T2"]
["1. Uncertainty stops me from having a strong opinion. ",null,null,null,null,null,null,{"$f":"'Quest T1'!N142","v":3},{"$f":"'Quest T2'!N127","v":3}]
["2. Being uncertain means that a person is disorganized. ",null,null,null,null,null,null,{"$f":"'Quest T1'!N143","v":1},{"$f":"'Quest T2'!N128","v":1}]
["3. Uncertainty makes life intolerable.",null,null,null,null,null,null,{"$f":"'Quest T1'!N144","v":2},{"$f":"'Quest T2'!N129","v":1}]
["4. It’s unfair having no guarantees in life.",null,null,null,null,null,null,{"$f":"'Quest T1'!N145","v":2},{"$f":"'Quest T2'!N130","v":1}]
["5. My mind can’t be relaxed if I don’t know what will happen tomorrow.",null,null,null,null,null,null,{"$f":"'Quest T1'!N146","v":1},{"$f":"'Quest T2'!N131","v":1}]
["6. Uncertainty makes me uneasy, anxious, or stressed.",null,null,null,null,null,null,{"$f":"'Quest T1'!N147","v":1},{"$f":"'Quest T2'!N132","v":1}]
["7. Unforeseen events upset me greatly.",null,null,null,null,null,null,{"$f":"'Quest T1'!N148","v":2},{"$f":"'Quest T2'!N133","v":1}]
["8. It frustrates me not having all the information I need.",null,null,null,null,null,null,{"$f":"'Quest T1'!N149","v":1},{"$f":"'Quest T2'!N134","v":1}]
["9. Uncertainty keeps me from living a full life.",null,null,null,null,null,null,{"$f":"'Quest T1'!N150","v":1},{"$f":"'Quest T2'!N135","v":1}]
["10. One should always look ahead so as to avoid surprises.",null,null,null,null,null,null,{"$f":"'Quest T1'!N151","v":1},{"$f":"'Quest T2'!N136","v":1}]
["11. As mall unforeseen event can spoil everything, even with the best planning.",null,null,null,null,null,null,{"$f":"'Quest T1'!N152","v":3},{"$f":"'Quest T2'!N137","v":4}]
["12. When it’s time to act, uncertainty paralyses me. ",null,null,null,null,null,null,{"$f":"'Quest T1'!N153","v":1},{"$f":"'Quest T2'!N138","v":1}]
["13. Being uncertain means that I am not first rate.",null,null,null,null,null,null,{"$f":"'Quest T1'!N154","v":1},{"$f":"'Quest T2'!N139","v":1}]
["14. When I am uncertain, I can’t go forward.",null,null,null,null,null,null,{"$f":"'Quest T1'!N155","v":1},{"$f":"'Quest T2'!N140","v":1}]
["15. When I am uncertain, I can’t function very well. ",null,null,null,null,null,null,{"$f":"'Quest T1'!N156","v":1},{"$f":"'Quest T2'!N141","v":1}]
["16. Unlike me, others seem to know where they are going with their lives.",null,null,null,null,null,null,{"$f":"'Quest T1'!N157","v":1},{"$f":"'Quest T2'!N142","v":1}]
["17. Uncertainty makes me vulnerable, unhappy, or sad.",null,null,null,null,null,null,{"$f":"'Quest T1'!N158","v":1},{"$f":"'Quest T2'!N143","v":1}]
["18. I always want to know what the future has in store for me.",null,null,null,null,null,null,{"$f":"'Quest T1'!N159","v":2},{"$f":"'Quest T2'!N144","v":1}]
["19. I can’t stand being taken by surprise.",null,null,null,null,null,null,{"$f":"'Quest T1'!N160","v":1},{"$f":"'Quest T2'!N145","v":2}]
["20. The smallest doubt can stop me from acting. ",null,null,null,null,null,null,{"$f":"'Quest T1'!N161","v":1},{"$f":"'Quest T2'!N146","v":1}]
["21. I should be able to organize everything in advance.",null,null,null,null,null,null,{"$f":"'Quest T1'!N162","v":1},{"$f":"'Quest T2'!N147","v":2}]
["22. Being uncertain means that I lack confidence.",null,null,null,null,null,null,{"$f":"'Quest T1'!N163","v":1},{"$f":"'Quest T2'!N148","v":1}]
["23. I think it’s unfair that other people seem to be sure about their future.",null,null,null,null,null,null,{"$f":"'Quest T1'!N164","v":1},{"$f":"'Quest T2'!N149","v":1}]
["24. Uncertainty keeps me from sleeping soundly. ",null,null,null,null,null,null,{"$f":"'Quest T1'!N165","v":1},{"$f":"'Quest T2'!N150","v":1}]
["25. I must get away from all uncertain situations.",null,null,null,null,null,null,{"$f":"'Quest T1'!N166","v":1},{"$f":"'Quest T2'!N151","v":1}]
["26. The ambiguities in life stress me.",null,null,null,null,null,null,{"$f":"'Quest T1'!N167","v":2},{"$f":"'Quest T2'!N152","v":1}]
["27. I can’t stand being undecided about my future. ",null,null,null,null,null,null,{"$f":"'Quest T1'!N168","v":1},{"$f":"'Quest T2'!N153","v":2}]
[]
[]
[]
[]
[]
[null,"T1",null,null,"T2",null,null,null,null,null,null,"Confidence level"]
[null,"Sum","Mean","Percentile","Sum","Mean","Percentile","d","Sdiff","RCI","d/SD","Two-tailed","One-tailed"]
["TOTAL",{"$f":"SUM(H8:H34)","v":36},{"$f":"AVERAGE(H8:H34)","v":1.3333333333333333},{"$f":"NORMDIST(B42,$F$70,$G$70,TRUE)*100","v":30.732456872696577},{"$f":"SUM(I8:I34)","v":35},{"$f":"AVERAGE(I8:I34)","v":1.2962962962962963},{"$f":"NORMDIST(E42,$F$70,$G$70,TRUE)*100","v":28.3520836777585},{"$f":"E42-B42","v":-1},{"$f":"SQRT(2*(G70*SQRT(1-H70))^2)","v":10.456098698845569},{"$f":"H42/I42","v":-9.5637964866418818E-2},{"$f":"H42/G70","v":-6.8965517241379309E-2},{"$f":"IF(ABS(J42)>0.84,(1-((1-_xlfn.NORM.S.DIST(ABS(J42),TRUE))*2)),\"no change\")","v":"no change"},{"$f":"IF(ABS(J42)>0.84,_xlfn.NORM.S.DIST(ABS(J42),TRUE),\"no change\")","v":"no change"}]
[]
[]
[]
[]
[]
[]
[]
[]
[]
[]
[]
[]
[]
[]
[]
[]
[]
[]
[]
[]
[]
[]
[]
[]
[]
[null,null,null,null,null,"Norms (Buhr & Dugas, 2002)"]
[null,null,null,null,null,"M","SD","rxx"]
[null,null,null,null,null,43.3,14.5,0.74]
[]
[]
[]
[]
[]
[]
[]
[]
[]
[]
[]
[]
[]
[]
[]
[]
[]
[]
[]
[]
[]
[]
[]
[]
[]
[]
[]
[]
[]
[]
[]
[]
[]
[]
[]
[]
[]
[]
[]
[]
[]
[]
[]
[]
[]
[]
[]
[]
[]
[]
[]
[]
[]
[]
[]
[]
[]
[]
[]
[]
[]
[]
[]
[]
[]
[]
[]
[]
[]
[]
[]
[]
[]
[]
[]
[]
[]
[]
[]
[]
[]
[]
[]
[]
[]
[]
[]
[]
[]
[]
[]
[]
[]
[]
[]
[]
[]
[]
[]
[]
[]
[]
[]
[]
[]
[]
[]
[]
[]
[]
[]
[]
[]
[]
[]
[]
[]
[]
[]
[]
[]
[]
[]
[]
[]
[]
[]
[]
[]
[]
[]
[]
[]
[]
[]
[]
[]
[]
[]
[]
[]
[]
[]
[]
[]
[]
[]
[]
[]
[]
[]
[]
[]
[]
[]
[]
[]
[]
[]
[]
[]
[]
[]
[]
[]
[]
[]
[]
[]
[]
[]
[]
[]
[]
[]
[]
[]
[]
[]
[]
[]
[]
[]
[]
[]
[]
[]
[]
[]
[]
[]
[]
[]
[]
[]
[]
[]
[]
[]
[]
[]
[]
[null,null,null,null,"Dimension 1"]
[null,null,null,null,{"$f":"A42","v":"TOTAL"}]
[null,null,null,null,"T1",{"$f":"B42","v":36}]
[null,null,null,null,"T2",{"$f":"E42","v":35}]
[null,null,null,null,"norme M",{"$f":"F70","v":43.3}]
[null,null,null,null,"norme SD",{"$f":"G70","v":14.5}]
[null,null,null,null,null,null,"x","densité"]
[null,null,null,null,-30,{"$f":"E280*F$278/10","v":-43.5},{"$f":"F280+F$277","v":-0.20000000000000284},{"$f":"NORMDIST(G280,F$277,F$278,FALSE)","v":3.0564471806469016E-4},1]
[null,null,null,null,{"$f":"E280+0.5","v":-29.5},{"$f":"E281*F$278/10","v":-42.774999999999999},{"$f":"F281+F$277","v":0.52499999999999858},3.5466489124509951E-4,2]
[null,null,null,null,{"$f":"E281+0.5","v":-29},-42.05,1.25,4.1051947722592098E-4,3]
[null,null,null,null,-28.5,-41.325000000000003,1.9749999999999943,4.7398390969751527E-4,4]
[null,null,null,null,-28,-40.6,2.6999999999999957,5.4589321261930735E-4,5]
[null,null,null,null,-27.5,-39.875,3.4249999999999972,6.271422414890381E-4,6]
[null,null,null,null,-27,-39.15,4.1499999999999986,7.1868515961535202E-4,7]
[null,null,null,null,-26.5,-38.424999999999997,4.875,8.2153404190380536E-4,8]
[null,null,null,null,-26,-37.700000000000003,5.5999999999999943,9.3675649887486987E-4,9]
[null,null,null,null,-25.5,-36.975000000000001,6.3249999999999957,1.0654722161651834E-3,10]
[null,null,null,null,-25,-36.25,7.0499999999999972,1.2088483099012785E-3,11]
[null,null,null,null,-24.5,-35.524999999999999,7.7749999999999986,1.3680934063307129E-3,12]
[null,null,null,null,-24,-34.799999999999997,8.5,1.5444503651615793E-3,13]
[null,null,null,null,-23.5,-34.075000000000003,9.2249999999999943,1.7391875803582332E-3,14]
[null,null,null,null,-23,-33.35,9.9499999999999957,1.9535888097655971E-3,15]
[null,null,null,null,-22.5,-32.625,10.674999999999997,2.1889415059080978E-3,16]
[null,null,null,null,-22,-31.9,11.399999999999999,2.4465236445676865E-3,17]
[null,null,null,null,-21.5,-31.175000000000001,12.124999999999996,2.727589075128981E-3,18]
[null,null,null,null,-21,-30.45,12.849999999999998,3.0333514469260132E-3,19]
[null,null,null,null,-20.5,-29.725000000000001,13.574999999999996,3.3649667985643258E-3,20]
[null,null,null,null,-20,-29,14.299999999999997,3.7235149319440044E-3,21]
[null,null,null,null,-19.5,-28.274999999999999,15.024999999999999,4.1099797288838679E-3,22]
[null,null,null,null,-19,-27.55,15.749999999999996,4.5252286051501089E-3,23]
[null,null,null,null,-18.5,-26.824999999999999,16.474999999999998,4.9699913335322773E-3,24]
[null,null,null,null,-18,-26.1,17.199999999999996,5.4448385035099417E-3,25]
[null,null,null,null,-17.5,-25.375,17.924999999999997,5.9501599190697604E-3,26]
[null,null,null,null,-17,-24.65,18.649999999999999,6.4861432673715136E-3,27]
[null,null,null,null,-16.5,-23.925000000000001,19.374999999999996,7.0527534182053793E-3,28]
[null,null,null,null,-16,-23.2,20.099999999999998,7.6497127365141781E-3,29]
[null,null,null,null,-15.5,-22.475000000000001,20.824999999999996,8.276482806688662E-3,30]
[null,null,null,null,-15,-21.75,21.549999999999997,8.93224797695805E-3,31]
[null,null,null,null,-14.5,-21.024999999999999,22.274999999999999,9.6159011341627777E-3,32]
[null,null,null,null,-14,-20.3,22.999999999999996,{"$f":"NORMDIST(G312,F$277,F$278,FALSE)","v":1.0326032112809988E-2},33]
[null,null,null,null,-13.5,-19.574999999999999,23.724999999999998,1.106091912702894E-2,34]
[null,null,null,null,-13,-18.850000000000001,24.449999999999996,1.1818523589503955E-2,35]
[null,null,null,null,-12.5,-18.125,25.174999999999997,1.2596488647518753E-2,36]
[null,null,null,null,-12,-17.399999999999999,25.9,1.3392141722980205E-2,37]
[null,null,null,null,-11.5,-16.675000000000001,26.624999999999996,1.4202501291032741E-2,38]
[null,null,null,null,-11,-15.95,27.349999999999998,1.5024288071210385E-2,39]
[null,null,null,null,-10.5,-15.225,28.074999999999996,1.5853940736843656E-2,40]
[null,null,null,null,-10,-14.5,28.799999999999997,1.6687636173734026E-2,41]
[null,null,null,null,-9.5,-13.775,29.524999999999999,1.7521314239254415E-2,42]
[null,null,null,null,-9,-13.05,30.249999999999996,1.8350706889569298E-2,43]
[null,null,null,null,-8.5,-12.324999999999999,30.974999999999998,1.9171371457310103E-2,44]
[null,null,null,null,-8,-11.6,31.699999999999996,1.9978727776653982E-2,45]
[null,null,null,null,-7.5,-10.875,32.424999999999997,2.0768098769296858E-2,46]
[null,null,null,null,-7,-10.15,33.15,2.1534754025293881E-2,47]
[null,null,null,null,-6.5,-9.4250000000000007,33.875,2.2273955839166505E-2,48]
[null,null,null,null,-6,-8.6999999999999993,34.599999999999994,2.2981007095986179E-2,49]
[null,null,null,null,-5.5,-7.9749999999999996,35.324999999999996,2.3651300346164406E-2,50]
[null,null,null,null,-5,-7.25,36.049999999999997,2.4280367363055139E-2,51]
[null,null,null,null,-4.5,-6.5250000000000004,36.774999999999999,2.4863928445630897E-2,52]
[null,null,null,null,-4,-5.8,37.5,2.5397940710574024E-2,53]
[null,null,null,null,-3.5,-5.0750000000000002,38.224999999999994,2.5878644614961231E-2,54]
[null,null,null,null,-3,-4.3499999999999996,38.949999999999996,2.6302607962794766E-2,55]
[null,null,null,null,-2.5,-3.625,39.674999999999997,2.6666766676058568E-2,56]
[null,null,null,null,-2,-2.9,40.4,2.6968461653479717E-2,57]
[null,null,null,null,-1.5,-2.1749999999999998,41.125,2.7205471097095792E-2,58]
[null,null,null,null,-1,-1.45,41.849999999999994,2.7376037757035294E-2,59]
[null,null,null,null,-0.5,-0.72499999999999998,42.574999999999996,2.7478890627225108E-2,60]
[null,null,null,null,0,0,43.3,2.7513260717340185E-2,61]
[null,null,null,null,0.5,0.72499999999999998,44.024999999999999,2.7478890627225108E-2,62]
[null,null,null,null,1,1.45,44.75,2.7376037757035294E-2,63]
[null,null,null,null,1.5,2.1749999999999998,45.474999999999994,2.7205471097095792E-2,64]
[null,null,null,null,2,2.9,46.199999999999996,{"$f":"NORMDIST(G344,F$277,F$278,FALSE)","v":2.6968461653479717E-2},65]
[null,null,null,null,2.5,{"$f":"E345*F$278/10","v":3.625},{"$f":"F345+F$277","v":46.924999999999997},2.6666766676058568E-2,66]
[null,null,null,null,{"$f":"E345+0.5","v":3},4.3499999999999996,47.65,2.6302607962794766E-2,67]
[null,null,null,null,{"$f":"E346+0.5","v":3.5},5.0750000000000002,48.375,2.5878644614961231E-2,68]
[null,null,null,null,{"$f":"E347+0.5","v":4},5.8,49.099999999999994,2.5397940710574024E-2,69]
[null,null,null,null,{"$f":"E348+0.5","v":4.5},6.5250000000000004,49.824999999999996,2.4863928445630897E-2,70]
[null,null,null,null,5,7.25,50.55,2.4280367363055139E-2,71]
[null,null,null,null,5.5,7.9749999999999996,51.274999999999999,2.3651300346164406E-2,72]
[null,null,null,null,6,8.6999999999999993,52,2.2981007095986179E-2,73]
[null,null,null,null,6.5,9.4250000000000007,52.724999999999994,2.2273955839166505E-2,74]
[null,null,null,null,7,10.15,53.449999999999996,2.1534754025293881E-2,75]
[null,null,null,null,7.5,10.875,54.174999999999997,2.0768098769296858E-2,76]
[null,null,null,null,8,11.6,54.9,1.9978727776653982E-2,77]
[null,null,null,null,8.5,12.324999999999999,55.625,1.9171371457310099E-2,78]
[null,null,null,null,9,13.05,56.349999999999994,1.8350706889569302E-2,79]
[null,null,null,null,9.5,13.775,57.074999999999996,1.7521314239254415E-2,80]
[null,null,null,null,10,14.5,57.8,1.6687636173734026E-2,81]
[null,null,null,null,10.5,15.225,58.524999999999999,1.5853940736843656E-2,82]
[null,null,null,null,11,15.95,59.25,1.5024288071210382E-2,83]
[null,null,null,null,11.5,16.675000000000001,59.974999999999994,1.4202501291032744E-2,84]
[null,null,null,null,{"$f":"E363+0.5","v":12},17.399999999999999,60.699999999999996,1.3392141722980205E-2,85]
[null,null,null,null,{"$f":"E364+0.5","v":12.5},18.125,61.424999999999997,1.2596488647518753E-2,86]
[null,null,null,null,13,18.850000000000001,62.15,1.1818523589503955E-2,87]
[null,null,null,null,13.5,19.574999999999999,62.875,1.1060919127028938E-2,88]
[null,null,null,null,14,20.3,63.599999999999994,1.0326032112809991E-2,89]
[null,null,null,null,14.5,21.024999999999999,64.324999999999989,9.6159011341627847E-3,90]
[null,null,null,null,15,21.75,65.05,8.93224797695805E-3,91]
[null,null,null,null,15.5,22.475000000000001,65.775000000000006,8.276482806688655E-3,92]
[null,null,null,null,16,23.2,66.5,7.6497127365141755E-3,93]
[null,null,null,null,16.5,23.925000000000001,67.224999999999994,7.0527534182053819E-3,94]
[null,null,null,null,17,24.65,67.949999999999989,6.4861432673715179E-3,95]
[null,null,null,null,17.5,25.375,68.674999999999997,5.9501599190697604E-3,96]
[null,null,null,null,18,26.1,69.400000000000006,{"$f":"NORMDIST(G376,F$277,F$278,FALSE)","v":5.4448385035099382E-3},97]
[null,null,null,null,18.5,26.824999999999999,70.125,4.9699913335322756E-3,98]
[null,null,null,null,19,27.55,70.849999999999994,4.5252286051501098E-3,99]
[null,null,null,null,19.5,28.274999999999999,71.574999999999989,4.1099797288838714E-3,100]
[null,null,null,null,20,29,72.3,3.7235149319440044E-3,101]
[null,null,null,null,20.5,29.725000000000001,73.025000000000006,3.3649667985643228E-3,102]
[null,null,null,null,21,30.45,73.75,3.0333514469260132E-3,103]
[null,null,null,null,21.5,31.175000000000001,74.474999999999994,2.727589075128981E-3,104]
[null,null,null,null,22,31.9,75.199999999999989,2.4465236445676882E-3,105]
[null,null,null,null,22.5,32.625,75.924999999999997,2.1889415059080978E-3,106]
[null,null,null,null,23,33.35,76.650000000000006,1.9535888097655944E-3,107]
[null,null,null,null,23.5,34.075000000000003,77.375,1.7391875803582332E-3,108]
[null,null,null,null,24,34.799999999999997,78.099999999999994,1.5444503651615793E-3,109]
[null,null,null,null,24.5,35.524999999999999,78.824999999999989,1.3680934063307142E-3,110]
[null,null,null,null,25,36.25,79.55,1.2088483099012785E-3,111]
[null,null,null,null,25.5,36.975000000000001,80.275000000000006,1.0654722161651821E-3,112]
[null,null,null,null,26,37.700000000000003,81,9.3675649887486987E-4,113]
[null,null,null,null,26.5,38.424999999999997,81.724999999999994,8.2153404190380536E-4,114]
[null,null,null,null,27,39.15,82.449999999999989,7.1868515961535267E-4,115]
[null,null,null,null,27.5,39.875,83.174999999999997,6.271422414890381E-4,116]
[null,null,null,null,28,40.6,83.9,5.4589321261930659E-4,117]
[null,null,null,null,28.5,41.325000000000003,84.625,4.7398390969751527E-4,118]
[null,null,null,null,29,42.05,85.35,4.1051947722592098E-4,119]
[null,null,null,null,29.5,42.774999999999999,86.074999999999989,3.5466489124510016E-4,120]
[null,null,null,null,30,43.5,86.8,3.0564471806469016E-4,121]
[]
[]
[]
[]
[]
[]
[null,null,null,null,"Marque ","x","y"]
[null,null,null,null,"T1",{"$f":"VLOOKUP(F$275,G280:J400,3,TRUE)","v":50},{"$f":"VLOOKUP(F$275,G280:H400,2,TRUE)","v":2.3651300346164406E-2}]
[null,null,null,null,"T2",{"$f":"VLOOKUP(F$276,G280:J400,3,TRUE)","v":49},{"$f":"VLOOKUP(F$276,G280:H400,2,TRUE)","v":2.2981007095986179E-2}]
[]
[null,null,null,null,"Moyenne norme","x","y"]
[]
[]
[null,null,null,null,"Ecart sup","x","y"]
[null,null,null,null,null,71,0]
[null,null,null,null,null,71,{"$f":"VLOOKUP(5,E280:I400,4,TRUE)","v":2.4280367363055139E-2}]
[null,null,null,null,"Ecart inf","x","y"]
[null,null,null,null,null,51,0]
[null,null,null,null,null,51,{"$f":"VLOOKUP(-5,E280:I400,4,TRUE)","v":2.4280367363055139E-2}]
[null,null,null,null,"Ecart 2 sup","x","y"]
[null,null,null,null,null,91,0]
[null,null,null,null,null,91,{"$f":"VLOOKUP(15,E280:I400,4,TRUE)","v":8.93224797695805E-3}]
[null,null,null,null,"Ecart 2 inf","x","y"]
[null,null,null,null,null,31,0]
[null,null,null,null,null,31,{"$f":"VLOOKUP(-15,E280:J400,4,TRUE)","v":8.93224797695805E-3}]

{"sheet":"MCQ","index":8,"n_rows":424,"n_cols":39,"rows_kept":424,"cut":false,"hidden":false,"merged":[[38,12,38,13],[6,10,6,13],[7,10,7,13],[8,10,8,13],[9,10,9,13],[10,10,10,13],[11,10,11,13],[12,10,12,13],[13,10,13,13],[14,10,14,13],[15,10,15,13],[16,10,16,13],[17,10,17,13],[18,10,18,13],[19,10,19,13],[20,10,20,13],[21,10,21,13],[22,10,22,13],[23,10,23,13],[24,10,24,13],[25,10,25,13],[26,10,26,13],[27,10,27,13],[28,10,28,13],[29,10,29,13],[30,10,30,13],[31,10,31,13],[32,10,32,13],[33,10,33,13],[34,10,34,13],[35,10,35,13],[36,10,36,13],[38,2,38,4],[38,5,38,7],[6,1,6,7],[7,1,7,7],[8,1,8,7],[9,1,9,7],[10,1,10,7],[11,1,11,7],[12,1,12,7],[13,1,13,7],[14,1,14,7],[15,1,15,7],[16,1,16,7],[17,1,17,7],[18,1,18,7],[19,1,19,7],[20,1,20,7],[21,1,21,7],[22,1,22,7],[23,1,23,7],[24,1,24,7],[25,1,25,7],[26,1,26,7],[27,1,27,7],[28,1,28,7],[34,1,34,7],[35,1,35,7],[36,1,36,7],[29,1,29,7],[30,1,30,7],[31,1,31,7],[32,1,32,7],[33,1,33,7]]}
["Meta-Cognitions Questionnaire"]
[]
[null,null,null,"Do not agree","Agree slightly","Agree moderately","Agree very much"]
[null,null,null,1,2,3,4]
[]
[]
["N","Item",null,null,null,null,null,null,"Score T1","Score T2","Dimensions"]
[1,"Worrying helps me to avoid problems in the future",null,null,null,null,null,null,{"$f":"'Quest T1'!N173","v":3},{"$f":"'Quest T2'!N158","v":2},"Positive worry beliefs"]
[2,"My worrying is dangerous for me",null,null,null,null,null,null,{"$f":"'Quest T1'!N174","v":2},{"$f":"'Quest T2'!N159","v":2},"Beliefs about uncontrollability and danger"]
[3,"I think a lot about my thoughts",null,null,null,null,null,null,{"$f":"'Quest T1'!N175","v":1},{"$f":"'Quest T2'!N160","v":1},"Cognitive self-consciousness"]
[4,"I could make myself sick with worrying",null,null,null,null,null,null,{"$f":"'Quest T1'!N176","v":2},{"$f":"'Quest T2'!N161","v":2},"Beliefs about uncontrollability and danger"]
[5,"I am aware of the way my mind works when I am thinking through a problem",null,null,null,null,null,null,{"$f":"'Quest T1'!N177","v":1},{"$f":"'Quest T2'!N162","v":1},"Cognitive self-consciousness"]
[6,"If I did not control a worrying thought, and then it happened, it would be my fault",null,null,null,null,null,null,{"$f":"'Quest T1'!N178","v":4},{"$f":"'Quest T2'!N163","v":3},"General negative beliefs (including responsibility, supersition and punishment)"]
[7,"I need to worry in order to remain organized",null,null,null,null,null,null,{"$f":"'Quest T1'!N179","v":2},{"$f":"'Quest T2'!N164","v":2},"Positive worry beliefs"]
[8,"I have little confidence in my memory for words and names",null,null,null,null,null,null,{"$f":"'Quest T1'!N180","v":1},{"$f":"'Quest T2'!N165","v":3},"Beliefs about cognitive competence"]
[9,"My worrying thoughts persist, no matter how I try to stop them",null,null,null,null,null,null,{"$f":"'Quest T1'!N181","v":4},{"$f":"'Quest T2'!N166","v":2},"Beliefs about uncontrollability and danger"]
[10,"Worrying helps me to get things sorted out in my mind",null,null,null,null,null,null,{"$f":"'Quest T1'!N182","v":2},{"$f":"'Quest T2'!N167","v":2},"Positive worry beliefs"]
[11,"I cannot ignore my worrying thoughts",null,null,null,null,null,null,{"$f":"'Quest T1'!N183","v":4},{"$f":"'Quest T2'!N168","v":2},"Beliefs about uncontrollability and danger"]
[12,"I monitor my thoughts",null,null,null,null,null,null,{"$f":"'Quest T1'!N184","v":1},{"$f":"'Quest T2'!N169","v":1},"Cognitive self-consciousness"]
[13,"I should be in control of my thoughts all of the time",null,null,null,null,null,null,{"$f":"'Quest T1'!N185","v":2},{"$f":"'Quest T2'!N170","v":1},"General negative beliefs (including responsibility, supersition and punishment)"]
[14,"My memory can mislead me at times",null,null,null,null,null,null,{"$f":"'Quest T1'!N186","v":4},{"$f":"'Quest T2'!N171","v":2},"Beliefs about cognitive competence"]
[15,"My worrying could make me go mad",null,null,null,null,null,null,{"$f":"'Quest T1'!N187","v":2},{"$f":"'Quest T2'!N172","v":1},"Beliefs about uncontrollability and danger"]
[16,"I am constantly aware of my thinking",null,null,null,null,null,null,{"$f":"'Quest T1'!N188","v":1},{"$f":"'Quest T2'!N173","v":2},"Cognitive self-consciousness"]
[17,"I have a poor memory",null,null,null,null,null,null,{"$f":"'Quest T1'!N189","v":4},{"$f":"'Quest T2'!N174","v":1},"Beliefs about cognitive competence"]
[18,"I pay close attention to the way my mind works",null,null,null,null,null,null,{"$f":"'Quest T1'!N190","v":2},{"$f":"'Quest T2'!N175","v":2},"Cognitive self-consciousness"]
[19,"Worrying helps me to cope",null,null,null,null,null,null,{"$f":"'Quest T1'!N191","v":1},{"$f":"'Quest T2'!N176","v":2},"Positive worry beliefs"]
[20,"Not being able to control my thoughts is a sign of weakness",null,null,null,null,null,null,{"$f":"'Quest T1'!N192","v":2},{"$f":"'Quest T2'!N177","v":1},"General negative beliefs (including responsibility, supersition and punishment)"]
[21,"If I could not control my thoughts, I would not be able to function",null,null,null,null,null,null,{"$f":"'Quest T1'!N193","v":1},{"$f":"'Quest T2'!N178","v":1},"General negative beliefs (including responsibility, supersition and punishment)"]
[22,"When I start worrying, I cannot stop",null,null,null,null,null,null,{"$f":"'Quest T1'!N194","v":3},{"$f":"'Quest T2'!N179","v":1},"Beliefs about uncontrollability and danger"]
[23,"I will be punished for not controlling certain thoughts",null,null,null,null,null,null,{"$f":"'Quest T1'!N195","v":1},{"$f":"'Quest T2'!N180","v":2},"General negative beliefs (including responsibility, supersition and punishment)"]
[24,"Worrying helps me to solve problems",null,null,null,null,null,null,{"$f":"'Quest T1'!N196","v":1},{"$f":"'Quest T2'!N181","v":1},"Positive worry beliefs"]
[25,"I have little confidence in my memory for places",null,null,null,null,null,null,{"$f":"'Quest T1'!N197","v":1},{"$f":"'Quest T2'!N182","v":1},"Beliefs about cognitive competence"]
[26,"It is bad to think certain thoughts",null,null,null,null,null,null,{"$f":"'Quest T1'!N198","v":4},{"$f":"'Quest T2'!N183","v":2},"General negative beliefs (including responsibility, supersition and punishment)"]
[27,"I do not trust my memory",null,null,null,null,null,null,{"$f":"'Quest T1'!N199","v":4},{"$f":"'Quest T2'!N184","v":2},"Beliefs about cognitive competence"]
[28,"I need to worry in order to work well",null,null,null,null,null,null,{"$f":"'Quest T1'!N200","v":2},{"$f":"'Quest T2'!N185","v":2},"Positive worry beliefs"]
[29,"I have little confidence in my memory for actions",null,null,null,null,null,null,{"$f":"'Quest T1'!N201","v":1},{"$f":"'Quest T2'!N186","v":1},"Beliefs about cognitive competence"]
[30,"I constantly examine my thoughts",null,null,null,null,null,null,{"$f":"'Quest T1'!N202","v":1},{"$f":"'Quest T2'!N187","v":1},"Cognitive self-consciousness"]
[]
[null,null,"T1",null,null,"T2",null,null,null,null,null,null,"Confidence level"]
[null,null,"Sum","Mean","Percentile","Sum","Mean","Percentile","d","Sdiff","RCI","d/SD","Two-tailed","One-tailed"]
[null,"Positive worry beliefs",{"$f":"SUM(I8,I14,I17,I26,I31,I35)","v":11},{"$f":"AVERAGE(I8,I14,I17,I26,I31,I35)","v":1.8333333333333333},{"$f":"NORMDIST(C41,L108,M108,TRUE)*100","v":52.448573440030813},{"$f":"SUM(J8,J14,J17,J26,J31,J35)","v":11},{"$f":"AVERAGE(J8,J14,J17,J26,J31,J35)","v":1.8333333333333333},{"$f":"NORMDIST(F41,L108,M108,TRUE)*100","v":52.448573440030813},{"$f":"F41-C41","v":0},{"$f":"SQRT(2*(M108*SQRT(1-#REF!))^2)","v":{"$error":"#REF!"}},{"$f":"I41/J41","v":{"$error":"#REF!"}},{"$f":"I41/M108","v":0},{"$f":"IF(ABS(K41)>0.84,(1-((1-_xlfn.NORM.S.DIST(ABS(K41),TRUE))*2)),\"no change\")","v":{"$error":"#REF!"}},{"$f":"IF(ABS(K41)>0.84,_xlfn.NORM.S.DIST(ABS(K41),TRUE),\"no change\")","v":{"$error":"#REF!"}}]
[null,"Beliefs about uncontrollability and danger",{"$f":"SUM(I9,I11,I16,I18,I22,I29)","v":17},{"$f":"AVERAGE(I9,I11,I16,I18,I22,I29)","v":2.8333333333333335},84.215058971583375,{"$f":"SUM(J9,J11,J16,J18,J22,J29)","v":10},{"$f":"AVERAGE(J9,J11,J16,J18,J22,J29)","v":1.6666666666666667},21.391290778826317,-7,{"$f":"SQRT(2*(M109*SQRT(1-#REF!))^2)","v":{"$error":"#REF!"}},{"$error":"#REF!"},-1.7962535283551451,{"$error":"#REF!"},{"$error":"#REF!"}]
[null,"Beliefs about cognitive competence",{"$f":"SUM(I15,I21,I24,I32,I34,I36)","v":15},{"$f":"AVERAGE(I15,I21,I24,I32,I34,I36)","v":2.5},86.272736398660697,{"$f":"SUM(J15,J21,J24,J32,J34,J36)","v":10},{"$f":"AVERAGE(J15,J21,J24,J32,J34,J36)","v":1.6666666666666667},41.877237521676172,-5,{"$f":"SQRT(2*(M110*SQRT(1-#REF!))^2)","v":{"$error":"#REF!"}},{"$error":"#REF!"},-1.2976901116013495,{"$error":"#REF!"},{"$error":"#REF!"}]
[null,"General negative beliefs (including responsibility, supersition and punishment)",{"$f":"SUM(I13,I20,I27,I28,I30,I33)","v":14},{"$f":"AVERAGE(I13,I20,I27,I28,I30,I33)","v":2.3333333333333335},86.769980706961164,{"$f":"SUM(J13,J20,J27,J28,J30,J33)","v":10},{"$f":"AVERAGE(J13,J20,J27,J28,J30,J33)","v":1.6666666666666667},48.623818944844444,-4,{"$f":"SQRT(2*(M111*SQRT(1-#REF!))^2)","v":{"$error":"#REF!"}},{"$error":"#REF!"},-1.1500862564692351,{"$error":"#REF!"},{"$error":"#REF!"}]
[null,"Cognitive self-consciousness",{"$f":"SUM(I10,I12,I19,I23,I25,I37)","v":7},{"$f":"AVERAGE(I10,I12,I19,I23,I25,I37)","v":1.1666666666666667},3.398307852020471,{"$f":"SUM(J10,J12,J19,J23,J25,J37)","v":8},{"$f":"AVERAGE(J10,J12,J19,J23,J25,J37)","v":1.3333333333333333},6.3381655195714908,1,{"$f":"SQRT(2*(M112*SQRT(1-#REF!))^2)","v":{"$error":"#REF!"}},{"$error":"#REF!"},0.29824038174768863,{"$error":"#REF!"},{"$error":"#REF!"}]
[null,"TOTAL",{"$f":"SUM(I8:I37)","v":64},{"$f":"AVERAGE(I8:I37)","v":2.1333333333333333},70.80972825205501,{"$f":"SUM(J8:J37)","v":49},{"$f":"AVERAGE(J8:J37)","v":1.6333333333333333},21.269794393066764,-15,{"$f":"SQRT(2*(M113*SQRT(1-#REF!))^2)","v":{"$error":"#REF!"}},{"$error":"#REF!"},-1.34492961535013,{"$error":"#REF!"},{"$error":"#REF!"}]
[]
[]
[]
[]
[]
[]
[]
[]
[]
[]
[]
[]
[]
[]
[]
[]
[]
[]
[]
[]
[]
[]
[]
[]
[]
[]
[]
[]
[]
[]
[]
[]
[]
[]
[]
[]
[]
[]
[]
[]
[]
[]
[]
[]
[]
[]
[]
[]
[]
[]
[]
[]
[]
[]
[]
[]
[]
[]
[]
[]
[null,null,null,null,null,null,null,null,null,null,"Norms (Wells, 2004)","M","SD","rxx"]
[null,null,null,null,null,null,null,null,null,null,"Positive worry beliefs",10.77,3.7450000000000001,0.745]
[null,null,null,null,null,null,null,null,null,null,"Beliefs about uncontrollability and danger",13.09,3.8969999999999998,0.64100000000000001]
[null,null,null,null,null,null,null,null,null,null,"Beliefs about cognitive competence",10.79,3.8530000000000002,0.71699999999999997]
[null,null,null,null,null,null,null,null,null,null,"General negative beliefs (including responsibility, supersition and punishment)",10.119999999999999,3.4780000000000002,0.58099999999999996]
[null,null,null,null,null,null,null,null,null,null,"Cognitive self-consciousness",13.12,3.3530000000000002,0.74299999999999999]
[null,null,null,null,null,null,null,null,null,null,"TOTAL",57.89,11.153,0.746]
[]
[]
[]
[]
[]
[]
[]
[]
[]
[]
[]
[]
[]
[]
[]
[]
[]
[]
[]
[]
[]
[]
[]
[]
[]
[]
[]
[]
[]
[]
[]
[]
[]
[]
[]
[]
[]
[]
[]
[]
[]
[]
[]
[]
[]
[]
[]
[]
[]
[]
[]
[]
[]
[]
[]
[]
[]
[]
[]
[]
[]
[]
[]
[]
[]
[]
[]
[]
[]
[]
[]
[]
[]
[]
[]
[]
[]
[]
[]
[]
[]
[]
[]
[]
[]
[]
[]
[]
[]
[]
[]
[]
[]
[]
[]
[]
[]
[]
[]
[]
[]
[]
[]
[]
[]
[]
[]
[]
[]
[]
[]
[]
[]
[]
[]
[]
[]
[]
[]
[]
[]
[]
[]
[]
[]
[]
[]
[]
[]
[]
[]
[]
[]
[]
[]
[]
[]
[]
[]
[]
[]
[]
[]
[]
[]
[]
[]
[]
[]
[]
[]
[]
[]
[]
[]
[]
[]
[]
[null,null,null,null,"Dimension 1",null,null,null,null,null,"Dimension 2",null,null,null,null,null,"Dimension3",null,null,null,null,null,"Dimension4",null,null,null,null,null,"Dimension 5",null,null,null,null,null,"Dimension 6"]
[null,null,null,null,{"$f":"B41","v":"Positive worry beliefs"},null,null,null,null,null,{"$f":"B42","v":"Beliefs about uncontrollability and danger"},null,null,null,null,null,{"$f":"B43","v":"Beliefs about cognitive competence"},null,null,null,null,null,{"$f":"B44","v":"General negative beliefs (including responsibility, supersition and punishment)"},null,null,null,null,null,{"$f":"B45","v":"Cognitive self-consciousness"},null,null,null,null,null,{"$f":"B46","v":"TOTAL"}]
[null,null,null,null,"T1",{"$f":"C41","v":11},null,null,null,null,"T1",{"$f":"C42","v":17},null,null,null,null,"T1",{"$f":"C43","v":15},null,null,null,null,"T1",{"$f":"C44","v":14},null,null,null,null,"T1",{"$f":"C45","v":7},null,null,null,null,"T1",{"$f":"C46","v":64}]
[null,null,null,null,"T2",{"$f":"F41","v":11},null,null,null,null,"T2",{"$f":"F42","v":10},null,null,null,null,"T2",{"$f":"F43","v":10},null,null,null,null,"T2",{"$f":"F44","v":10},null,null,null,null,"T2",{"$f":"F45","v":8},null,null,null,null,"T2",{"$f":"F46","v":49}]
[null,null,null,null,"norme M",{"$f":"L108","v":10.77},null,null,null,null,"norme M",{"$f":"L109","v":13.09},null,null,null,null,"norme M",{"$f":"L110","v":10.79},null,null,null,null,"norme M",{"$f":"L111","v":10.119999999999999},null,null,null,null,"norme M",{"$f":"L112","v":13.12},null,null,null,null,"norme M",{"$f":"L113","v":57.89}]
[null,null,null,null,"norme SD",{"$f":"M108","v":3.7450000000000001},null,null,null,null,"norme SD",{"$f":"M109","v":3.8969999999999998},null,null,null,null,"norme SD",{"$f":"M110","v":3.8530000000000002},null,null,null,null,"norme SD",{"$f":"M111","v":3.4780000000000002},null,null,null,null,"norme SD",{"$f":"M112","v":3.3530000000000002},null,null,null,null,"norme SD",{"$f":"M113","v":11.153}]
[null,null,null,null,null,null,"x","densité",null,null,null,null,"x","densité",null,null,null,null,"x","densité",null,null,null,null,"x","densité",null,null,null,null,"x","densité",null,null,null,null,"x","densité"]
[null,null,null,null,-30,{"$f":"E279*F$277/10","v":-11.235000000000001},{"$f":"F279+F$276","v":-0.46500000000000163},{"$f":"NORMDIST(G279,F$276,F$277,FALSE)","v":1.1834041153372494E-3},1,null,-30,{"$f":"K279*L$277/10","v":-11.690999999999999},{"$f":"L279+L$276","v":1.3990000000000009},{"$f":"NORMDIST(M279,L$276,L$277,FALSE)","v":1.1372461924398275E-3},1,null,-30,{"$f":"Q279*R$277/10","v":-11.559000000000001},{"$f":"R279+R$276","v":-0.7690000000000019},{"$f":"NORMDIST(S279,R$276,R$277,FALSE)","v":1.1502331720576193E-3},1,null,-30,{"$f":"W279*X$277/10","v":-10.434000000000001},{"$f":"X279+X$276","v":-0.31400000000000183},{"$f":"NORMDIST(Y279,X$276,X$277,FALSE)","v":1.2742519873312269E-3},1,null,-30,{"$f":"AC279*AD$277/10","v":-10.059000000000001},{"$f":"AD279+AD$276","v":3.0609999999999982},{"$f":"NORMDIST(AE279,AD$276,AD$277,FALSE)","v":1.3217561622242788E-3},1,null,-30,{"$f":"AI279*AJ$277/10","v":-33.459000000000003},{"$f":"AJ279+AJ$276","v":24.430999999999997},{"$f":"NORMDIST(AK279,AJ$276,AJ$277,FALSE)","v":3.9736827866385788E-4},1]
[null,null,null,null,{"$f":"E279+0.5","v":-29.5},{"$f":"E280*F$277/10","v":-11.047750000000001},{"$f":"F280+F$276","v":-0.27775000000000105},1.3732018486125339E-3,2,null,{"$f":"K279+0.5","v":-29.5},{"$f":"K280*L$277/10","v":-11.49615},{"$f":"L280+L$276","v":1.5938499999999998},1.3196409861570284E-3,2,null,{"$f":"Q279+0.5","v":-29.5},{"$f":"Q280*R$277/10","v":-11.366350000000001},{"$f":"R280+R$276","v":-0.57635000000000147},1.3347108546727068E-3,2,null,{"$f":"W279+0.5","v":-29.5},{"$f":"W280*X$277/10","v":-10.2601},{"$f":"X280+X$276","v":-0.14010000000000034},1.4786201618901505E-3,2,null,{"$f":"AC279+0.5","v":-29.5},{"$f":"AC280*AD$277/10","v":-9.8913499999999992},{"$f":"AD280+AD$276","v":3.22865},1.5337431920828938E-3,2,null,{"$f":"AI279+0.5","v":-29.5},{"$f":"AI280*AJ$277/10","v":-32.901350000000001},{"$f":"AJ280+AJ$276","v":24.98865},4.6109933856845184E-4,2]
[null,null,null,null,{"$f":"E280+0.5","v":-29},-10.8605,-9.0500000000000469E-2,1.5894612602872773E-3,3,null,{"$f":"K280+0.5","v":-29},-11.301299999999999,1.7887000000000004,1.5274653373815381E-3,3,null,{"$f":"Q280+0.5","v":-29},-11.1737,-0.38370000000000104,1.5449084920259157E-3,3,null,{"$f":"W280+0.5","v":-29},-10.086200000000002,3.379999999999761E-2,1.711481431792941E-3,3,null,{"$f":"AC280+0.5","v":-29},-9.7237000000000009,3.3962999999999983,1.7752855412394434E-3,3,null,{"$f":"AI280+0.5","v":-29},-32.343699999999998,25.546300000000002,5.3371580917922117E-4,3]
[null,null,null,null,-28.5,-10.673249999999999,9.6750000000000114E-2,1.8351846970931847E-3,4,null,-28.5,-11.106449999999999,1.983550000000001,1.7636044882252961E-3,4,null,-28.5,-10.98105,-0.19105000000000061,1.7837442747505781E-3,4,null,-28.5,-9.9123000000000001,0.20769999999999911,1.9760686286986709E-3,4,null,-28.5,-9.5560500000000008,3.5639499999999984,2.0497365614715094E-3,4,null,-28.5,-31.786049999999999,26.103950000000001,6.1622583077324282E-4,4]
[null,null,null,null,-28,-10.486000000000001,0.28399999999999892,2.1136052291001223E-3,5,null,-28,-10.9116,2.1783999999999999,2.0311654049217239E-3,5,null,-28,-10.788399999999999,1.5999999999998238E-3,2.0543606496184704E-3,5,null,-28,-9.7384000000000004,0.38159999999999883,2.2758630198332283E-3,5,null,-28,-9.3884000000000007,3.7315999999999985,2.3607073018132889E-3,5,null,-28,-31.228400000000001,26.6616,7.0971501685465502E-4,5]
[null,null,null,null,-27.5,-10.29875,0.4712499999999995,2.4281875838694398E-3,6,null,-27.5,-10.716749999999999,2.3732500000000005,2.3334776755429953E-3,6,null,-27.5,-10.595750000000001,0.19424999999999848,2.3601252275087079E-3,6,null,-27.5,-9.5645000000000007,0.55549999999999855,2.6145953138559668E-3,6,null,-27.5,-9.2207500000000007,3.8992499999999986,2.7120675519209819E-3,6,null,-27.5,-30.670750000000005,27.219249999999995,8.1534676782848037E-4,6]
[null,null,null,null,-27,-10.111500000000001,0.65849999999999831,2.7826261186709189E-3,7,null,-27,-10.521899999999999,2.5681000000000012,2.6740915613093674E-3,7,null,-27,-10.4031,0.38689999999999891,2.704628812463692E-3,7,null,-27,-9.3906000000000009,0.72939999999999827,2.9962434774073003E-3,7,null,-27,-9.0531000000000006,4.0668999999999986,3.1079435772211721E-3,7,null,-27,-30.113100000000003,27.776899999999998,9.3436159010334356E-4,7]
[null,null,null,null,-26.5,-9.9242500000000007,0.84574999999999889,3.1808394145808223E-3,8,null,-26.5,-10.32705,2.76295,3.0567728015409748E-3,8,null,-26.5,-10.21045,0.57954999999999934,3.0916801473151257E-3,8,null,-26.5,-9.2166999999999994,0.90329999999999977,3.4250269142050587E-3,8,null,-26.5,-8.8854500000000005,4.2345499999999987,3.5527120810036322E-3,8,null,-26.5,-29.55545,28.33455,1.0680752808755651E-3,8]
[null,null,null,null,-26,-9.7370000000000001,1.0329999999999995,3.6269610770856106E-3,9,null,-26,-10.132199999999999,2.9578000000000007,3.4854937730781658E-3,9,null,-26,-10.017800000000001,0.772199999999998,3.5252969721478364E-3,9,null,-26,-9.0428000000000015,1.0771999999999977,3.9053965594265704E-3,9,null,-26,-8.7178000000000004,4.4021999999999988,4.0509899295215071E-3,9,null,-26,-28.997800000000002,28.892199999999999,1.2178758391182295E-3,9]
[null,null,null,null,-25.5,-9.5497499999999995,1.2202500000000001,4.1253263376222092E-3,10,null,-25.5,-9.9373499999999986,3.1526500000000013,3.9644206144201118E-3,10,null,-25.5,-9.8251500000000007,0.96484999999999843,4.0096930014002488E-3,10,null,-25.5,-8.8689,1.2510999999999992,4.4420204526725623E-3,10,null,-25.5,-8.5501500000000004,4.5698499999999989,4.6076191871145759E-3,10,null,-25.5,-28.440149999999999,29.449850000000001,1.3852189665915155E-3,10]
[null,null,null,null,-25,-9.3625000000000007,1.4074999999999989,4.6804540703787824E-3,11,null,-25,-9.7424999999999997,3.3475000000000001,4.4978959439488176E-3,11,null,-25,-9.6325000000000003,1.1574999999999989,4.54926044473619E-3,11,null,-25,-8.6950000000000003,1.4249999999999989,5.0397643742290223E-3,11,null,-25,-8.3825000000000003,4.7374999999999989,5.2276470305900801E-3,11,null,-25,-27.8825,30.0075,1.5716220293704418E-3,11]
[null,null,null,null,-24.5,-9.1752500000000001,1.5947499999999994,5.2970238696382673E-3,12,null,-24.5,-9.5476500000000009,3.542349999999999,5.0904168313562516E-3,12,null,-24.5,-9.4398499999999999,1.3501499999999993,5.1485477269128822E-3,12,null,-24.5,-8.5211000000000006,1.5988999999999987,5.7036671626783534E-3,12,null,-24.5,-8.2148500000000002,4.905149999999999,5.9163001466732285E-3,12,null,-24.5,-27.324850000000005,30.565149999999996,1.7786563607814321E-3,12]
[null,null,null,null,-24,-8.9879999999999995,1.782,5.9798478757924958E-3,13,null,-24,-9.3527999999999984,3.7372000000000014,5.7466077225668214E-3,13,null,-24,-9.2472000000000012,1.542799999999998,5.8122321035148925E-3,13,null,-24,-8.3472000000000008,1.7727999999999984,6.4389103780456867E-3,13,null,-24,-8.0472000000000001,5.0727999999999991,6.6789532641941245E-3,13,null,-24,-26.767200000000003,31.122799999999998,2.0079378010259929E-3,13]
[null,null,null,null,-23.5,-8.8007500000000007,1.9692499999999988,6.7338370935098478E-3,14,null,-23.5,-9.1579499999999996,3.9320500000000003,6.4711880716434144E-3,14,null,-23.5,-9.0545500000000008,1.7354499999999984,6.5450869232271947E-3,14,null,-23.5,-8.1733000000000011,1.9466999999999981,7.2507820342709558E-3,14,null,-23.5,-7.8795500000000001,5.2404499999999992,7.5210915345047353E-3,14,null,-23.5,-26.20955,31.68045,2.2611153873571578E-3,14]
[null,null,null,null,-23,-8.6135000000000002,2.1564999999999994,7.5639620137786879E-3,15,null,-23,-8.9631000000000007,4.1268999999999991,7.2689344987429197E-3,15,null,-23,-8.8619000000000003,1.9280999999999988,7.3519433536468172E-3,15,null,-23,-7.9993999999999996,2.1205999999999996,8.1446341982752118E-3,15,null,-23,-7.7119,5.4080999999999992,8.4482665498363217E-3,15,null,-23,-25.651900000000001,32.238100000000003,2.5398581315880199E-3,15]
[null,null,null,null,-22.5,-8.4262499999999996,2.34375,8.4752074327549849E-3,16,null,-22.5,-8.7682499999999983,4.3217500000000015,8.1446373712259299E-3,16,null,-22.5,-8.6692500000000017,2.1207499999999975,8.2376464665630394E-3,16,null,-22.5,-7.8255000000000008,2.2944999999999984,9.1258343403299077E-3,16,null,-22.5,-7.5442500000000008,5.5757499999999984,9.4660458800081768E-3,16,null,-22.5,-25.094250000000002,32.795749999999998,2.8458398489794152E-3,16]
[null,null,null,null,-22,-8.2390000000000008,2.5309999999999988,9.4725214542674026E-3,17,null,-22,-8.5733999999999995,4.5166000000000004,9.1030517952864834E-3,17,null,-22,-8.4766000000000012,2.3133999999999979,9.2070056699276974E-3,17,null,-22,-7.6516000000000002,2.468399999999999,1.0199710421573161E-2,17,null,-22,-7.3766000000000007,5.7433999999999985,1.0579956112803884E-2,17,null,-22,-24.5366,33.353400000000001,3.1807220340923027E-3,17]
[null,null,null,null,-21.5,-8.0517500000000002,2.7182499999999994,1.0560758768857202E-2,18,null,-21.5,-8.3785500000000006,4.7114499999999992,1.0148843107356991E-2,18,null,-21.5,-8.2839500000000008,2.5060499999999983,1.0264739576789571E-2,18,null,-21.5,-7.4777000000000005,2.6422999999999988,1.1371489818680339E-2,18,null,-21.5,-7.2089499999999997,5.9110499999999995,1.1795419501750736E-2,18,null,-21.5,-23.978950000000001,33.911050000000003,3.5461348147915557E-3,18]
[null,null,null,null,-21,-7.8644999999999996,2.9055,1.1744618419339716E-2,19,null,-21,-8.1836999999999982,4.9063000000000017,1.1286527067084228E-2,19,null,-21,-8.0913000000000004,2.6986999999999988,1.1415415515293846E-2,19,null,-21,-7.3038000000000007,2.8161999999999985,1.2646232311796202E-2,19,null,-21,-7.0413000000000014,6.0786999999999978,1.311768445583871E-2,19,null,-21,-23.421300000000002,34.468699999999998,3.9436560549114307E-3,19]
[null,null,null,null,-20.5,-7.6772500000000008,3.0927499999999988,1.3028576389634904E-2,20,null,-20.5,-7.9888499999999993,5.1011500000000005,1.2520405075489547E-2,20,null,-20.5,-7.8986500000000008,2.8913499999999983,1.266338400705495E-2,20,null,-20.5,-7.129900000000001,2.9900999999999982,1.4028757498327406E-2,20,null,-20.5,-6.8736500000000005,6.2463499999999987,1.4551750247295783E-2,20,null,-20.5,-22.86365,35.026350000000001,4.3747887186571114E-3,20]
[null,null,null,null,-20,-7.49,3.2799999999999994,1.4416813488167706E-2,21,null,-20,-7.7939999999999996,5.2960000000000003,1.3854494871231219E-2,21,null,-20,-7.7060000000000004,3.0839999999999987,1.4012708671992748E-2,21,null,-20,-6.9560000000000004,3.1639999999999988,1.5523567140077072E-2,21,null,-20,-6.7060000000000004,6.4139999999999988,1.6102286463819879E-2,21,null,-20,-22.306000000000001,35.584000000000003,4.8409366549975862E-3,21]
[null,null,null,null,-19.5,-7.3027500000000005,3.4672499999999991,1.5913139137200546E-2,22,null,-19.5,-7.5991499999999998,5.49085,1.5292457292485521E-2,22,null,-19.5,-7.51335,3.2766499999999992,1.5467092153858312E-2,22,null,-19.5,-6.7820999999999998,3.3378999999999994,1.7134763102017281E-2,22,null,-19.5,-6.5383499999999994,6.5816499999999998,1.777354788810501E-2,22,null,-19.5,-21.748350000000002,36.141649999999998,5.3433790073357888E-3,22]
[null,null,null,null,-19,-7.1154999999999999,3.6544999999999996,1.7520911822343548E-2,23,null,-19,-7.4042999999999992,5.6857000000000006,1.683751982927293E-2,23,null,-19,-7.3207000000000004,3.4692999999999987,1.7029798799552711E-2,23,null,-19,-6.608200000000001,3.5117999999999983,1.8865961694846632E-2,23,null,-19,-6.3707000000000003,6.749299999999999,1.9569285647085176E-2,23,null,-19,-21.1907,36.699300000000001,5.8832435017194115E-3,23]
[null,null,null,null,-18.5,-6.9282500000000002,3.8417499999999993,1.9242957099123627E-2,24,null,-18.5,-7.2094499999999995,5.8805500000000004,1.8492397828128823E-2,24,null,-18.5,-7.12805,3.6619499999999992,1.8703574963980799E-2,24,null,-18.5,-6.4343000000000004,3.6856999999999989,2.07202053870667E-2,24,null,-18.5,-6.2030500000000002,6.916949999999999,2.1492655632632873E-2,24,null,-18.5,-20.633050000000001,37.256950000000003,6.4614789147510125E-3,24]
[null,null,null,null,-18,-6.7409999999999997,4.0289999999999999,2.1081484192495108E-2,25,null,-18,-7.0145999999999997,6.0754000000000001,2.0259214344596908E-2,25,null,-18,-6.9353999999999996,3.8545999999999996,2.0490567947286317E-2,25,null,-18,-6.2604000000000006,3.8595999999999986,2.2699873001982215E-2,25,null,-18,-6.035400000000001,7.0845999999999982,2.354612535069911E-2,25,null,-18,-20.075400000000002,37.814599999999999,7.0788270690302297E-3,25]
[null,null,null,null,-17.5,-6.5537500000000009,4.2162499999999987,2.30380023568789E-2,26,null,-17.5,-6.8197499999999991,6.2702500000000008,2.2139419765591882E-2,26,null,-17.5,-6.7427500000000009,4.0472499999999982,2.2392244699328177E-2,26,null,-17.5,-6.0865,4.0334999999999992,2.4806589656846324E-2,26,null,-17.5,-5.86775,7.2522499999999992,2.5731380502985842E-2,26,null,-17.5,-19.517749999999999,38.372250000000001,7.7357947481853807E-3,26]
[null,null,null,null,-17,-6.3665000000000003,4.4034999999999993,2.511323828488303E-2,27,null,-17,-6.6248999999999993,6.4651000000000005,2.4133712439539892E-2,27,null,-17,-6.5501000000000005,4.2398999999999987,2.4409311543443276E-2,27,null,-17,-5.9126000000000003,4.2073999999999989,2.7041137831192334E-2,27,null,-17,-5.7001000000000008,7.4198999999999984,2.8049232739900658E-2,27,null,-17,-18.960100000000001,38.929900000000004,8.4326259640354131E-3,27]
[null,null,null,null,-16.5,-6.1792500000000006,4.590749999999999,2.7307055958338579E-2,28,null,-16.5,-6.4300499999999996,6.6599500000000003,2.624196165357404E-2,28,null,-16.5,-6.35745,4.4325499999999991,2.654163627406645E-2,28,null,-16.5,-5.7386999999999997,4.3812999999999995,2.9403371064973555E-2,28,null,-16.5,-5.5324499999999999,7.5875499999999994,3.0499530141359386E-2,28,null,-16.5,-18.402450000000002,39.487549999999999,9.1692750438427308E-3,28]
[null,null,null,null,-16,-5.992,4.7779999999999996,2.9618380421750488E-2,29,null,-16,-6.2351999999999999,6.8548,2.8463134380152823E-2,29,null,-16,-6.1648000000000005,4.6251999999999986,2.8788174066819504E-2,29,null,-16,-5.5648,4.5551999999999992,3.1892131880234501E-2,29,null,-16,-5.3648000000000007,7.7551999999999985,3.3081072078573082E-2,29,null,-16,-17.844799999999999,40.045200000000001,9.9453810346503708E-3,29]
[null,null,null,null,-15.5,-5.8047500000000003,4.9652499999999993,3.2045127021892009E-2,30,null,-15.5,-6.0403499999999992,7.0496500000000006,3.0795227276619364E-2,30,null,-15.5,-5.972150000000001,4.8178499999999982,3.1146898701527526E-2,30,null,-15.5,-5.3909000000000002,4.729099999999999,3.4505175588552497E-2,30,null,-15.5,-5.1971500000000006,7.9228499999999986,3.5791530181027605E-2,30,null,-15.5,-17.28715,40.602850000000004,1.0760243943063361E-2,30]
[null,null,null,null,-15,-5.6175000000000006,5.152499999999999,3.4584137694497107E-2,31,null,-15,-5.8454999999999995,7.2445000000000004,3.3235205456990442E-2,31,null,-15,-5.7795000000000005,5.0104999999999986,3.3614740634801903E-2,31,null,-15,-5.2170000000000005,4.9029999999999987,3.7239101686570367E-2,31,null,-15,-5.0295000000000005,8.0904999999999987,3.8627377174438336E-2,31,null,-15,-16.729500000000002,41.160499999999999,1.1612803341333428E-2,31]
[null,null,null,null,-14.5,-5.43025,5.3397499999999996,3.7231125886611559E-2,32,null,-14.5,-5.6506499999999997,7.4393500000000001,3.5778949562576413E-2,32,null,-14.5,-5.5868500000000001,5.2031499999999991,3.618753346622379E-2,32,null,-14.5,-5.0431000000000008,5.0768999999999984,4.0089294550132319E-2,32,null,-14.5,-4.8618500000000004,8.2581499999999988,4.1583825363960714E-2,32,null,-14.5,-16.171849999999999,41.718150000000001,1.2501619873160608E-2,32]
[null,null,null,null,-14,-5.2430000000000003,5.5269999999999992,{"$f":"NORMDIST(G311,F$276,F$277,FALSE)","v":3.9980631678436532E-2},33,null,-14,-5.4558,7.6341999999999999,{"$f":"NORMDIST(M311,L$276,L$277,FALSE)","v":3.8421212634268627E-2},33,null,-14,-5.3941999999999997,5.3957999999999995,{"$f":"NORMDIST(S311,R$276,R$277,FALSE)","v":3.88599703181274E-2},33,null,-14,-4.8692000000000002,5.250799999999999,{"$f":"NORMDIST(Y311,X$276,X$277,FALSE)","v":4.304987511090997E-2},33,null,-14,-4.6942000000000004,8.4257999999999988,{"$f":"NORMDIST(AE311,AD$276,AD$277,FALSE)","v":4.465477650931847E-2},33,null,-14,-15.6142,42.275800000000004,{"$f":"NORMDIST(AK311,AJ$276,AJ$277,FALSE)","v":1.342486018432215E-2},33]
[null,null,null,null,-13.5,-5.0557500000000006,5.7142499999999989,4.2825988609324322E-2,34,null,-13.5,-5.2609499999999993,7.8290500000000005,4.1155588232465908E-2,34,null,-13.5,-5.2015500000000001,5.588449999999999,4.1625571591466293E-2,34,null,-13.5,-4.6953000000000005,5.4246999999999987,4.6113665135687057E-2,34,null,-13.5,-4.5265500000000003,8.5934499999999989,4.7832784772418604E-2,34,null,-13.5,-15.056550000000001,42.833449999999999,1.4380285783369459E-2,34]
[null,null,null,null,-13,-4.8685,5.9014999999999995,4.5759303617572057E-2,35,null,-13,-5.0660999999999996,8.0239000000000011,4.3974491159303929E-2,35,null,-13,-5.0089000000000006,5.7810999999999986,4.4476665467897046E-2,35,null,-13,-4.5214000000000008,5.5985999999999985,4.927216562616657E-2,35,null,-13,-4.3589000000000002,8.761099999999999,5.1109034311901981E-2,35,null,-13,-14.498900000000001,43.391100000000002,1.5365246305730064E-2,35]
[null,null,null,null,-12.5,-4.6812500000000004,6.0887499999999992,4.8771451372235493E-2,36,null,-12.5,-4.8712499999999999,8.21875,4.6869152011552971E-2,36,null,-12.5,-4.8162500000000001,5.973749999999999,4.7404382400472858E-2,36,null,-12.5,-4.3475000000000001,5.7724999999999991,5.2515550715647473E-2,36,null,-12.5,-4.1912500000000001,8.9287499999999991,5.4473332952288074E-2,36,null,-12.5,-13.94125,43.948750000000004,1.6376677610420692E-2,36]
[null,null,null,null,-12,-4.4939999999999998,6.2759999999999998,5.1852084107667007E-2,37,null,-12,-4.6763999999999992,8.4136000000000006,4.9829626631566072E-2,37,null,-12,-4.6236000000000006,6.1663999999999985,5.0398664672518273E-2,37,null,-12,-4.1736000000000004,5.9463999999999988,5.5832678258543121E-2,37,null,-12,-4.0236000000000001,9.0963999999999992,5.7914123168271089E-2,37,null,-12,-13.383600000000001,44.506399999999999,1.7411105082328786E-2,37]
[null,null,null,null,-11.5,-4.3067500000000001,6.4632499999999995,5.4989657869152143E-2,38,null,-11.5,-4.4815500000000004,8.6084499999999995,5.2844821329221137E-2,38,null,-11.5,-4.4309500000000002,6.359049999999999,5.3448291907597915E-2,38,null,-11.5,-3.9996999999999998,6.1202999999999994,5.9211118090849557E-2,38,null,-11.5,-3.85595,9.2640499999999992,6.1418511398739863E-2,38,null,-11.5,-12.825950000000001,45.064050000000002,1.846465244507978E-2,38]
[null,null,null,null,-11,-4.1195000000000004,6.6504999999999992,5.8171475843137657E-2,39,null,-11,-4.2866999999999997,8.8033000000000001,5.5902534522081229E-2,39,null,-11,-4.2383000000000006,6.5516999999999985,5.6540923185193492E-2,39,null,-11,-3.8258000000000001,6.2941999999999991,6.2637198686759793E-2,39,null,-11,-3.6883000000000004,9.4316999999999993,6.4972316442752934E-2,39,null,-11,-12.2683,45.621700000000004,1.9533056310638449E-2,39]
[null,null,null,null,-10.5,-3.9322499999999998,6.8377499999999998,6.1383749181370649E-2,40,null,-10.5,-4.0918499999999991,8.9981500000000008,5.8989515187126793E-2,40,null,-10.5,-4.0456500000000002,6.744349999999999,5.9663156159935893E-2,40,null,-10.5,-3.6519000000000004,6.4680999999999989,6.6096072652165896E-2,40,null,-10.5,-3.5206500000000007,9.5993499999999976,6.8560137394641479E-2,40,null,-10.5,-11.710650000000001,46.179349999999999,2.0611686603087331E-2,40]
[null,null,null,null,-10,-3.7450000000000001,7.0249999999999995,6.4611675439023603E-2,41,null,-10,-3.8969999999999998,9.1929999999999996,6.2091538239451717E-2,41,null,-10,-3.8530000000000002,6.9369999999999994,6.2800603301101321E-2,41,null,-10,-3.4780000000000002,6.6419999999999995,6.9571801184342544E-2,41,null,-10,-3.3530000000000002,9.7669999999999995,7.2165441252354121E-2,41,null,-10,-11.153,46.737000000000002,2.1695572896901587E-2,41]
[null,null,null,null,-9.5,-3.55775,7.2122499999999992,6.783953443770066E-2,42,null,-9.5,-3.7021499999999996,9.3878500000000003,6.5193496656194269E-2,42,null,-9.5,-3.6603500000000002,7.1296499999999989,6.5937985068567101E-2,42,null,-9.5,-3.3041000000000005,6.8158999999999992,7.3047457294188906E-2,42,null,-9.5,-3.1853500000000001,9.9346499999999995,7.5770669987828512E-2,42,null,-9.5,-10.59535,47.294650000000004,2.2779436606221563E-2,42]
[null,null,null,null,-9,-3.3704999999999998,7.3994999999999997,7.1050801041056044E-2,43,null,-9,-3.5072999999999999,9.5826999999999991,6.8279509853414105E-2,43,null,-9,-3.4676999999999998,7.3222999999999994,6.9059239527317642E-2,43,null,-9,-3.1302000000000003,6.9897999999999989,7.650524723943497E-2,43,null,-9,-3.0177000000000005,10.1023,7.9357366507233781E-2,43,null,-9,-10.037700000000001,47.8523,2.3857728853111701E-2,43]
[null,null,null,null,-8.5,-3.1832500000000001,7.5867499999999994,7.4228274000266076E-2,44,null,-8.5,-3.3124499999999997,9.7775499999999997,7.1333047506029368E-2,44,null,-8.5,-3.2750500000000002,7.5149499999999989,7.2147647581364258E-2,44,null,-8.5,-2.9563000000000001,7.1636999999999986,7.9926649261356078E-2,44,null,-8.5,-2.8500500000000004,10.269949999999998,8.2906318559796119E-2,44,null,-8.5,-9.4800500000000003,48.409950000000002,2.4924673731820716E-2,44]
[null,null,null,null,-8,-2.996,7.7739999999999991,7.7354219695990045E-2,45,null,-8,-3.1175999999999999,9.9724000000000004,7.4337067683213437E-2,45,null,-8,-3.0824000000000003,7.7075999999999993,7.5185972686603361E-2,45,null,-8,-2.7824,7.3375999999999992,8.3292568361553396E-2,45,null,-8,-2.6824000000000003,10.4376,8.6397719284665303E-2,45,null,-8,-8.9223999999999997,48.967600000000004,2.5974316575045533E-2,45]
[null,null,null,null,-7.5,-2.8087500000000003,7.9612499999999997,8.0410529280321622E-2,46,null,-7.5,-2.9227499999999997,10.167249999999999,7.7274167861125079E-2,46,null,-7.5,-2.8897500000000003,7.9002499999999989,7.815661358806239E-2,46,null,-7.5,-2.6085000000000003,7.511499999999999,8.658350550741932E-2,46,null,-7.5,-2.5147500000000003,10.605249999999998,8.9811342724367527E-2,46,null,-7.5,-8.3647500000000008,49.52525,2.7000576719699132E-2,46]
[null,null,null,null,-7,-2.6215000000000002,8.1484999999999985,8.3378887414355465E-2,47,null,-7,-2.7279,10.3621,8.0126747078973895E-2,47,null,-7,-2.6970999999999998,8.0929000000000002,8.1041768327734576E-2,47,null,-7,-2.4346000000000001,7.6853999999999996,8.9779739323393129E-2,47,null,-7,-2.3471000000000002,10.7729,9.3126732289520231E-2,47,null,-7,-7.8071000000000002,50.082900000000002,2.799730416630156E-2,47]
[null,null,null,null,-6.5,-2.43425,8.3357499999999991,8.6240950512126643E-2,48,null,-6.5,-2.5330499999999998,10.556950000000001,8.28771772306683E-2,48,null,-6.5,-2.5044500000000003,8.2855499999999989,8.3823607492321373E-2,48,null,-6.5,-2.2607000000000004,7.8592999999999993,9.2861518018376749E-2,48,null,-6.5,-2.1794500000000001,10.940549999999998,9.6323399841310539E-2,48,null,-6.5,-7.2494500000000004,50.640549999999998,2.8958339430459445E-2,48]
[null,null,null,null,-6,-2.2469999999999999,8.5229999999999997,8.8978532147343026E-2,49,null,-6,-2.3381999999999996,10.751799999999999,8.550798123987674E-2,49,null,-6,-2.3118000000000003,8.4781999999999993,8.6484454422994975E-2,49,null,-6,-2.0868000000000002,8.033199999999999,9.5809259025819327E-2,49,null,-6,-2.0118,11.1082,9.938103277417229E-2,49,null,-6,-6.6918000000000006,51.1982,2.987757579949786E-2,49]
[null,null,null,null,-5.5,-2.0597500000000002,8.7102499999999985,9.1573793062585812E-2,50,null,-5.5,-2.1433499999999999,10.94665,8.8002015658040514E-2,50,null,-5.5,-2.1191500000000003,8.6708499999999979,8.9006969898620267E-2,50,null,-5.5,-1.9129,8.2070999999999987,9.8603753599592836E-2,50,null,-5.5,-1.8441500000000002,11.275849999999998,0.10227970623900502,50,null,-5.5,-6.13415,51.755850000000002,3.0749023134527386E-2,50]
[null,null,null,null,-5,-1.8725000000000001,8.8974999999999991,9.4009433047877025E-2,51,null,-5,-1.9484999999999999,11.141500000000001,9.0342655058840024E-2,51,null,-5,-1.9265000000000001,8.8634999999999984,9.1374338635945879E-2,51,null,-5,-1.7390000000000001,8.3809999999999985,0.10122637342274279,51,null,-5,-1.6765000000000001,11.443499999999998,0.1050000974543094,51,null,-5,-5.5765000000000002,52.313499999999998,3.156687230021514E-2,51]
[null,null,null,null,-4.5,-1.6852499999999999,9.0847499999999997,9.6268881832215741E-2,52,null,-4.5,-1.7536499999999999,11.336349999999999,9.2513975484128305E-2,52,null,-4.5,-1.7338499999999999,9.0561499999999988,9.3570454830430305E-2,52,null,-4.5,-1.5651000000000002,8.5548999999999999,0.1036592761534353,52,null,-4.5,-1.5088500000000002,11.611149999999999,0.10752369891489649,52,null,-4.5,-5.0188500000000005,52.87115,3.232555926312633E-2,52]
[null,null,null,null,-4,-1.498,9.2720000000000002,9.8336486062302622E-2,53,null,-4,-1.5588,11.5312,9.4500934129669839E-2,53,null,-4,-1.5412000000000001,9.2487999999999992,9.5580103893932858E-2,53,null,-4,-1.3912,8.7287999999999997,0.10588560675771229,53,null,-4,-1.3412000000000002,11.778799999999999,0.109833027230338,53,null,-4,-4.4611999999999998,53.428800000000003,3.3019827876205804E-2,53]
[null,null,null,null,-3.5,-1.3107500000000001,9.459249999999999,0.10019768943042398,54,null,-3.5,-1.36395,11.726050000000001,9.62895424472512E-2,54,null,-3.5,-1.3485499999999999,9.4414499999999997,9.7389137533594045E-2,54,null,-3.5,-1.2173,8.9026999999999994,0.10788969146547955,54,null,-3.5,-1.1735500000000001,11.946449999999999,0.11191182431164265,54,null,-3.5,-3.9035500000000001,53.986449999999998,3.364479036285644E-2,54]
[null,null,null,null,-3,-1.1234999999999999,9.6464999999999996,0.10183920306022005,55,null,-3,-1.1690999999999998,11.9209,9.7867029884661047E-2,55,null,-3,-1.1559000000000001,9.6340999999999983,9.8984639361672483E-2,55,null,-3,-1.0434000000000001,9.0765999999999991,0.10965722123649342,55,null,-3,-1.0059,12.114099999999999,0.11374524767686371,55,null,-3,-3.3459000000000003,54.5441,3.4195984529769942E-2,55]
[null,null,null,null,-2.5,-0.93625000000000003,9.8337500000000002,0.10324916336524678,56,null,-2.5,-0.97424999999999995,12.11575,9.9221995587079614E-2,56,null,-2.5,-0.96325000000000005,9.8267499999999988,0.1003550783293146,56,null,-2.5,-0.86950000000000005,9.2504999999999988,0.11117542173744945,56,null,-2.5,-0.83825000000000005,12.281749999999999,0.11532004676494161,56,null,-2.5,-2.7882500000000001,55.101750000000003,3.4669426773321008E-2,56]
[null,null,null,null,-2,-0.749,10.020999999999999,0.10441727475980131,57,null,-2,-0.77939999999999998,12.310599999999999,0.10034454554155912,57,null,-2,-0.77060000000000006,10.019399999999999,0.10149044743718035,57,null,-2,-0.6956,9.4243999999999986,0.1124332070084692,57,null,-2,-0.67060000000000008,12.449399999999999,0.11662472233088454,57,null,-2,-2.2305999999999999,55.659399999999998,3.5061659999592563E-2,57]
[null,null,null,null,-1.5,-0.56174999999999997,10.20825,0.10533493482186621,58,null,-1.5,-0.5845499999999999,12.50545,0.10122641285806748,58,null,-1.5,-0.57795000000000007,10.21205,0.10238238539005681,58,null,-1.5,-0.52170000000000005,9.5982999999999983,0.11342131423458565,58,null,-1.5,-0.50295000000000001,12.617049999999999,0.11764966624154156,58,null,-1.5,-1.6729500000000002,56.21705,3.5369795652101584E-2,58]
[null,null,null,null,-1,-0.3745,10.3955,0.10599533978024346,59,null,-1,-0.38969999999999999,12.7003,0.10186105914216366,59,null,-1,-0.38530000000000003,10.404699999999998,0.10302427912717668,59,null,-1,-0.3478,9.7721999999999998,0.11413241733094071,59,null,-1,-0.33530000000000004,12.784699999999999,0.11838727929526149,59,null,-1,-1.1153,56.774700000000003,3.5591549132700781E-2,59]
[null,null,null,null,-0.5,-0.18725,10.582749999999999,0.10639356851662589,60,null,-0.5,-0.19485,12.895149999999999,0.10224375522062201,60,null,-0.5,-0.19265000000000002,10.597349999999999,0.10341134546970257,60,null,-0.5,-0.1739,9.9460999999999995,0.11456121739354916,60,null,-0.5,-0.16765000000000002,12.952349999999999,0.11883206504466567,60,null,-0.5,-0.55764999999999998,57.332349999999998,3.5725268008138078E-2,60]
[null,null,null,null,0,0,10.77,0.10652664363189124,61,null,0,0,13.09,0.10237163982587444,61,null,0,0,10.79,0.10354069047532641,61,null,0,0,10.119999999999999,0.11470450845354591,61,null,0,0,13.12,0.11898069800221674,61,null,0,0,57.89,3.5769952515146843E-2,61]
[null,null,null,null,0.5,0.18725,10.95725,0.10639356851662589,62,null,0.5,0.19485,13.28485,0.10224375522062201,62,null,0.5,0.19265000000000002,10.98265,0.10341134546970257,62,null,0.5,0.1739,10.293899999999999,0.11456121739354916,62,null,0.5,0.16765000000000002,13.287649999999999,0.11883206504466567,62,null,0.5,0.55764999999999998,58.447650000000003,3.5725268008138078E-2,62]
[null,null,null,null,1,0.3745,11.144499999999999,0.10599533978024346,63,null,1,0.38969999999999999,13.479699999999999,0.10186105914216366,63,null,1,0.38530000000000003,11.1753,0.10302427912717668,63,null,1,0.3478,10.467799999999999,0.11413241733094071,63,null,1,0.33530000000000004,13.455299999999999,0.11838727929526149,63,null,1,1.1153,59.005299999999998,3.5591549132700781E-2,63]
[null,null,null,null,1.5,0.56174999999999997,11.33175,0.10533493482186621,64,null,1.5,0.5845499999999999,13.67455,0.10122641285806748,64,null,1.5,0.57795000000000007,11.367949999999999,0.10238238539005681,64,null,1.5,0.52170000000000005,10.6417,0.11342131423458565,64,null,1.5,0.50295000000000001,13.622949999999999,0.11764966624154156,64,null,1.5,1.6729500000000002,59.562950000000001,3.5369795652101584E-2,64]
[null,null,null,null,2,0.749,11.519,{"$f":"NORMDIST(G343,F$276,F$277,FALSE)","v":0.10441727475980131},65,null,2,0.77939999999999998,13.869400000000001,{"$f":"NORMDIST(M343,L$276,L$277,FALSE)","v":0.10034454554155912},65,null,2,0.77060000000000006,11.560599999999999,{"$f":"NORMDIST(S343,R$276,R$277,FALSE)","v":0.10149044743718035},65,null,2,0.6956,10.8156,{"$f":"NORMDIST(Y343,X$276,X$277,FALSE)","v":0.1124332070084692},65,null,2,0.67060000000000008,13.7906,{"$f":"NORMDIST(AE343,AD$276,AD$277,FALSE)","v":0.11662472233088454},65,null,2,2.2305999999999999,60.120600000000003,{"$f":"NORMDIST(AK343,AJ$276,AJ$277,FALSE)","v":3.5061659999592563E-2},65]
[null,null,null,null,2.5,{"$f":"E344*F$277/10","v":0.93625000000000003},{"$f":"F344+F$276","v":11.706249999999999},0.10324916336524678,66,null,2.5,{"$f":"K344*L$277/10","v":0.97424999999999995},{"$f":"L344+L$276","v":14.064249999999999},9.9221995587079614E-2,66,null,2.5,{"$f":"Q344*R$277/10","v":0.96325000000000005},{"$f":"R344+R$276","v":11.75325},0.1003550783293146,66,null,2.5,{"$f":"W344*X$277/10","v":0.86950000000000005},{"$f":"X344+X$276","v":10.9895},0.11117542173744945,66,null,2.5,{"$f":"AC344*AD$277/10","v":0.83825000000000005},{"$f":"AD344+AD$276","v":13.95825},0.11532004676494161,66,null,2.5,{"$f":"AI344*AJ$277/10","v":2.7882500000000001},{"$f":"AJ344+AJ$276","v":60.678249999999998},3.4669426773321008E-2,66]
[null,null,null,null,{"$f":"E344+0.5","v":3},1.1234999999999999,11.8935,0.10183920306022005,67,null,{"$f":"K344+0.5","v":3},1.1690999999999998,14.2591,9.7867029884661047E-2,67,null,{"$f":"Q344+0.5","v":3},1.1559000000000001,11.9459,9.8984639361672483E-2,67,null,{"$f":"W344+0.5","v":3},1.0434000000000001,11.163399999999999,0.10965722123649342,67,null,{"$f":"AC344+0.5","v":3},1.0059,14.1259,0.11374524767686371,67,null,{"$f":"AI344+0.5","v":3},3.3459000000000003,61.235900000000001,3.4195984529769942E-2,67]
[null,null,null,null,{"$f":"E345+0.5","v":3.5},1.3107500000000001,12.08075,0.10019768943042398,68,null,{"$f":"K345+0.5","v":3.5},1.36395,14.453949999999999,9.62895424472512E-2,68,null,{"$f":"Q345+0.5","v":3.5},1.3485499999999999,12.138549999999999,9.7389137533594045E-2,68,null,{"$f":"W345+0.5","v":3.5},1.2173,11.337299999999999,0.10788969146547955,68,null,{"$f":"AC345+0.5","v":3.5},1.1735500000000001,14.29355,0.11191182431164265,68,null,{"$f":"AI345+0.5","v":3.5},3.9035500000000001,61.793550000000003,3.364479036285644E-2,68]
[null,null,null,null,{"$f":"E346+0.5","v":4},1.498,12.267999999999999,9.8336486062302622E-2,69,null,{"$f":"K346+0.5","v":4},1.5588,14.6488,9.4500934129669839E-2,69,null,{"$f":"Q346+0.5","v":4},1.5412000000000001,12.331199999999999,9.5580103893932858E-2,69,null,{"$f":"W346+0.5","v":4},1.3912,11.511199999999999,0.10588560675771229,69,null,{"$f":"AC346+0.5","v":4},1.3412000000000002,14.4612,0.109833027230338,69,null,{"$f":"AI346+0.5","v":4},4.4611999999999998,62.351199999999999,3.3019827876205804E-2,69]
[null,null,null,null,{"$f":"E347+0.5","v":4.5},1.6852499999999999,12.455249999999999,9.6268881832215741E-2,70,null,{"$f":"K347+0.5","v":4.5},1.7536499999999999,14.84365,9.2513975484128305E-2,70,null,{"$f":"Q347+0.5","v":4.5},1.7338499999999999,12.523849999999999,9.3570454830430305E-2,70,null,{"$f":"W347+0.5","v":4.5},1.5651000000000002,11.685099999999998,0.1036592761534353,70,null,{"$f":"AC347+0.5","v":4.5},1.5088500000000002,14.62885,0.10752369891489649,70,null,{"$f":"AI347+0.5","v":4.5},5.0188500000000005,62.908850000000001,3.232555926312633E-2,70]
[null,null,null,null,5,1.8725000000000001,12.6425,9.4009433047877025E-2,71,null,5,1.9484999999999999,15.038499999999999,9.0342655058840024E-2,71,null,5,1.9265000000000001,12.7165,9.1374338635945879E-2,71,null,5,1.7390000000000001,11.859,0.10122637342274279,71,null,5,1.6765000000000001,14.7965,0.1050000974543094,71,null,5,5.5765000000000002,63.466500000000003,3.156687230021514E-2,71]
[null,null,null,null,5.5,2.0597500000000002,12.829750000000001,9.1573793062585812E-2,72,null,5.5,2.1433499999999999,15.23335,8.8002015658040514E-2,72,null,5.5,2.1191500000000003,12.90915,8.9006969898620267E-2,72,null,5.5,1.9129,12.0329,9.8603753599592836E-2,72,null,5.5,1.8441500000000002,14.96415,0.10227970623900502,72,null,5.5,6.13415,64.024150000000006,3.0749023134527376E-2,72]
[null,null,null,null,6,2.2469999999999999,13.016999999999999,8.8978532147343026E-2,73,null,6,2.3381999999999996,15.4282,8.550798123987674E-2,73,null,6,2.3118000000000003,13.101799999999999,8.6484454422994975E-2,73,null,6,2.0868000000000002,12.206799999999999,9.5809259025819327E-2,73,null,6,2.0118,15.131799999999998,9.938103277417229E-2,73,null,6,6.6918000000000006,64.581800000000001,2.987757579949786E-2,73]
[null,null,null,null,6.5,2.43425,13.20425,8.6240950512126643E-2,74,null,6.5,2.5330499999999998,15.623049999999999,8.28771772306683E-2,74,null,6.5,2.5044500000000003,13.294449999999999,8.3823607492321373E-2,74,null,6.5,2.2607000000000004,12.380699999999999,9.2861518018376749E-2,74,null,6.5,2.1794500000000001,15.29945,9.6323399841310539E-2,74,null,6.5,7.2494500000000004,65.139449999999997,2.8958339430459463E-2,74]
[null,null,null,null,7,2.6215000000000002,13.391500000000001,8.3378887414355465E-2,75,null,7,2.7279,15.8179,8.0126747078973895E-2,75,null,7,2.6970999999999998,13.487099999999998,8.1041768327734576E-2,75,null,7,2.4346000000000001,12.554599999999999,8.9779739323393129E-2,75,null,7,2.3471000000000002,15.467099999999999,9.3126732289520231E-2,75,null,7,7.8071000000000002,65.697100000000006,2.799730416630155E-2,75]
[null,null,null,null,7.5,2.8087500000000003,13.578749999999999,8.0410529280321622E-2,76,null,7.5,2.9227499999999997,16.01275,7.7274167861125079E-2,76,null,7.5,2.8897500000000003,13.679749999999999,7.8156613588062404E-2,76,null,7.5,2.6085000000000003,12.7285,8.6583505507419292E-2,76,null,7.5,2.5147500000000003,15.63475,8.9811342724367527E-2,76,null,7.5,8.3647500000000008,66.254750000000001,2.7000576719699132E-2,76]
[null,null,null,null,8,2.996,13.766,7.7354219695990045E-2,77,null,8,3.1175999999999999,16.207599999999999,7.4337067683213437E-2,77,null,8,3.0824000000000003,13.872399999999999,7.5185972686603361E-2,77,null,8,2.7824,12.9024,8.3292568361553396E-2,77,null,8,2.6824000000000003,15.802399999999999,8.6397719284665303E-2,77,null,8,8.9223999999999997,66.812399999999997,2.5974316575045533E-2,77]
[null,null,null,null,8.5,3.1832500000000001,13.953250000000001,7.4228274000266076E-2,78,null,8.5,3.3124499999999997,16.402449999999998,7.1333047506029396E-2,78,null,8.5,3.2750500000000002,14.065049999999999,7.2147647581364258E-2,78,null,8.5,2.9563000000000001,13.0763,7.9926649261356078E-2,78,null,8.5,2.8500500000000004,15.970050000000001,8.2906318559796119E-2,78,null,8.5,9.4800500000000003,67.370050000000006,2.492467373182071E-2,78]
[null,null,null,null,9,3.3704999999999998,14.140499999999999,7.1050801041056044E-2,79,null,9,3.5072999999999999,16.597300000000001,6.8279509853414105E-2,79,null,9,3.4676999999999998,14.2577,6.9059239527317615E-2,79,null,9,3.1302000000000003,13.2502,7.650524723943497E-2,79,null,9,3.0177000000000005,16.137699999999999,7.9357366507233781E-2,79,null,9,10.037700000000001,67.927700000000002,2.3857728853111701E-2,79]
[null,null,null,null,9.5,3.55775,14.32775,6.783953443770066E-2,80,null,9.5,3.7021499999999996,16.792149999999999,6.5193496656194269E-2,80,null,9.5,3.6603500000000002,14.45035,6.5937985068567059E-2,80,null,9.5,3.3041000000000005,13.424099999999999,7.3047457294188906E-2,80,null,9.5,3.1853500000000001,16.305350000000001,7.5770669987828471E-2,80,null,9.5,10.59535,68.485349999999997,2.2779436606221563E-2,80]
[null,null,null,null,10,3.7450000000000001,14.515000000000001,6.4611675439023575E-2,81,null,10,3.8969999999999998,16.986999999999998,6.2091538239451745E-2,81,null,10,3.8530000000000002,14.642999999999999,6.2800603301101321E-2,81,null,10,3.4780000000000002,13.597999999999999,6.9571801184342544E-2,81,null,10,3.3530000000000002,16.472999999999999,7.2165441252354121E-2,81,null,10,11.153,69.043000000000006,2.1695572896901577E-2,81]
[null,null,null,null,10.5,3.9322499999999998,14.702249999999999,6.1383749181370649E-2,82,null,10.5,4.0918499999999991,17.181849999999997,5.898951518712682E-2,82,null,10.5,4.0456500000000002,14.835649999999999,5.9663156159935893E-2,82,null,10.5,3.6519000000000004,13.771899999999999,6.6096072652165924E-2,82,null,10.5,3.5206500000000007,16.640650000000001,6.8560137394641479E-2,82,null,10.5,11.710650000000001,69.600650000000002,2.0611686603087331E-2,82]
[null,null,null,null,11,4.1195000000000004,14.8895,5.8171475843137657E-2,83,null,11,4.2866999999999997,17.3767,5.5902534522081229E-2,83,null,11,4.2383000000000006,15.0283,5.6540923185193492E-2,83,null,11,3.8258000000000001,13.945799999999998,6.2637198686759807E-2,83,null,11,3.6883000000000004,16.808299999999999,6.4972316442752934E-2,83,null,11,12.2683,70.158299999999997,1.9533056310638449E-2,83]
[null,null,null,null,11.5,4.3067500000000001,15.076750000000001,5.4989657869152136E-2,84,null,11.5,4.4815500000000004,17.571550000000002,5.2844821329221102E-2,84,null,11.5,4.4309500000000002,15.220949999999998,5.3448291907597922E-2,84,null,11.5,3.9996999999999998,14.119699999999998,5.9211118090849571E-2,84,null,11.5,3.85595,16.975949999999997,6.1418511398739911E-2,84,null,11.5,12.825950000000001,70.715950000000007,1.8464652445079763E-2,84]
[null,null,null,null,{"$f":"E362+0.5","v":12},4.4939999999999998,15.263999999999999,5.1852084107667007E-2,85,null,{"$f":"K362+0.5","v":12},4.6763999999999992,17.766399999999997,4.98296266315661E-2,85,null,{"$f":"Q362+0.5","v":12},4.6236000000000006,15.413599999999999,5.039866467251828E-2,85,null,{"$f":"W362+0.5","v":12},4.1736000000000004,14.2936,5.5832678258543121E-2,85,null,{"$f":"AC362+0.5","v":12},4.0236000000000001,17.143599999999999,5.7914123168271089E-2,85,null,{"$f":"AI362+0.5","v":12},13.383600000000001,71.273600000000002,1.7411105082328786E-2,85]
[null,null,null,null,{"$f":"E363+0.5","v":12.5},4.6812500000000004,15.45125,4.8771451372235493E-2,86,null,{"$f":"K363+0.5","v":12.5},4.8712499999999999,17.96125,4.6869152011552971E-2,86,null,{"$f":"Q363+0.5","v":12.5},4.8162500000000001,15.606249999999999,4.7404382400472858E-2,86,null,{"$f":"W363+0.5","v":12.5},4.3475000000000001,14.467499999999999,5.2515550715647473E-2,86,null,{"$f":"AC363+0.5","v":12.5},4.1912500000000001,17.311250000000001,5.4473332952288039E-2,86,null,{"$f":"AI363+0.5","v":12.5},13.94125,71.831249999999997,1.6376677610420692E-2,86]
[null,null,null,null,13,4.8685,15.638500000000001,4.575930361757205E-2,87,null,13,5.0660999999999996,18.156099999999999,4.3974491159303929E-2,87,null,13,5.0089000000000006,15.7989,4.4476665467897046E-2,87,null,13,4.5214000000000008,14.641400000000001,4.9272165626166542E-2,87,null,13,4.3589000000000002,17.478899999999999,5.1109034311901981E-2,87,null,13,14.498900000000001,72.388900000000007,1.536524630573005E-2,87]
[null,null,null,null,13.5,5.0557500000000006,15.825749999999999,4.2825988609324329E-2,88,null,13.5,5.2609499999999993,18.350949999999997,4.1155588232465928E-2,88,null,13.5,5.2015500000000001,15.99155,4.1625571591466279E-2,88,null,13.5,4.6953000000000005,14.815300000000001,4.6113665135687036E-2,88,null,13.5,4.5265500000000003,17.646549999999998,4.7832784772418646E-2,88,null,13.5,15.056550000000001,72.946550000000002,1.4380285783369459E-2,88]
[null,null,null,null,14,5.2430000000000003,16.012999999999998,3.998063167843658E-2,89,null,14,5.4558,18.5458,3.8421212634268627E-2,89,null,14,5.3941999999999997,16.184199999999997,3.8859970318127428E-2,89,null,14,4.8692000000000002,14.9892,4.3049875110909956E-2,89,null,14,4.6942000000000004,17.8142,4.465477650931847E-2,89,null,14,15.6142,73.504199999999997,1.342486018432215E-2,89]
[null,null,null,null,14.5,5.43025,16.20025,3.7231125886611545E-2,90,null,14.5,5.6506499999999997,18.740649999999999,3.5778949562576427E-2,90,null,14.5,5.5868500000000001,16.376849999999997,3.6187533466223817E-2,90,null,14.5,5.0431000000000008,15.1631,4.0089294550132319E-2,90,null,14.5,4.8618500000000004,17.981850000000001,4.1583825363960679E-2,90,null,14.5,16.171849999999999,74.061849999999993,1.2501619873160622E-2,90]
[null,null,null,null,15,5.6175000000000006,16.387499999999999,3.4584137694497141E-2,91,null,15,5.8454999999999995,18.935499999999998,3.3235205456990463E-2,91,null,15,5.7795000000000005,16.569499999999998,3.3614740634801923E-2,91,null,15,5.2170000000000005,15.337,3.7239101686570367E-2,91,null,15,5.0295000000000005,18.1495,3.8627377174438336E-2,91,null,15,16.729500000000002,74.619500000000002,1.1612803341333428E-2,91]
[null,null,null,null,15.5,5.8047500000000003,16.574750000000002,3.2045127021891995E-2,92,null,15.5,6.0403499999999992,19.13035,3.0795227276619343E-2,92,null,15.5,5.972150000000001,16.762149999999998,3.1146898701527554E-2,92,null,15.5,5.3909000000000002,15.510899999999999,3.4505175588552497E-2,92,null,15.5,5.1971500000000006,18.317149999999998,3.5791530181027632E-2,92,null,15.5,17.28715,75.177149999999997,1.0760243943063361E-2,92]
[null,null,null,null,16,5.992,16.762,2.9618380421750478E-2,93,null,16,6.2351999999999999,19.325199999999999,2.8463134380152834E-2,93,null,16,6.1648000000000005,16.954799999999999,2.8788174066819515E-2,93,null,16,5.5648,15.684799999999999,3.1892131880234501E-2,93,null,16,5.3648000000000007,18.4848,3.3081072078573082E-2,93,null,16,17.844799999999999,75.734800000000007,9.9453810346503586E-3,93]
[null,null,null,null,16.5,6.1792500000000006,16.949249999999999,2.7307055958338593E-2,94,null,16.5,6.4300499999999996,19.520049999999998,2.6241961653574057E-2,94,null,16.5,6.35745,17.147449999999999,2.654163627406645E-2,94,null,16.5,5.7386999999999997,15.858699999999999,2.9403371064973555E-2,94,null,16.5,5.5324499999999999,18.652449999999998,3.04995301413594E-2,94,null,16.5,18.402450000000002,76.292450000000002,9.1692750438427308E-3,94]
[null,null,null,null,17,6.3665000000000003,17.136499999999998,2.5113238284883047E-2,95,null,17,6.6248999999999993,19.7149,2.4133712439539878E-2,95,null,17,6.5501000000000005,17.3401,2.4409311543443276E-2,95,null,17,5.9126000000000003,16.032599999999999,2.7041137831192344E-2,95,null,17,5.7001000000000008,18.8201,2.8049232739900658E-2,95,null,17,18.960100000000001,76.850099999999998,8.4326259640354131E-3,95]
[null,null,null,null,17.5,6.5537500000000009,17.32375,2.30380023568789E-2,96,null,17.5,6.8197499999999991,19.909749999999999,2.2139419765591882E-2,96,null,17.5,6.7427500000000009,17.53275,2.2392244699328177E-2,96,null,17.5,6.0865,16.206499999999998,2.4806589656846345E-2,96,null,17.5,5.86775,18.987749999999998,2.5731380502985859E-2,96,null,17.5,19.517749999999999,77.407749999999993,7.7357947481853867E-3,96]
[null,null,null,null,18,6.7409999999999997,17.510999999999999,{"$f":"NORMDIST(G375,F$276,F$277,FALSE)","v":2.1081484192495108E-2},97,null,18,7.0145999999999997,20.104599999999998,{"$f":"NORMDIST(M375,L$276,L$277,FALSE)","v":2.0259214344596925E-2},97,null,18,6.9353999999999996,17.7254,{"$f":"NORMDIST(S375,R$276,R$277,FALSE)","v":2.0490567947286299E-2},97,null,18,6.2604000000000006,16.380400000000002,{"$f":"NORMDIST(Y375,X$276,X$277,FALSE)","v":2.2699873001982198E-2},97,null,18,6.035400000000001,19.1554,{"$f":"NORMDIST(AE375,AD$276,AD$277,FALSE)","v":2.354612535069911E-2},97,null,18,20.075400000000002,77.965400000000002,{"$f":"NORMDIST(AK375,AJ$276,AJ$277,FALSE)","v":7.0788270690302297E-3},97]
[null,null,null,null,18.5,6.9282500000000002,17.698250000000002,1.924295709912361E-2,98,null,18.5,7.2094499999999995,20.29945,1.8492397828128813E-2,98,null,18.5,7.12805,17.918050000000001,1.8703574963980781E-2,98,null,18.5,6.4343000000000004,16.554299999999998,2.0720205387066728E-2,98,null,18.5,6.2030500000000002,19.323049999999999,2.1492655632632876E-2,98,null,18.5,20.633050000000001,78.523049999999998,6.4614789147510125E-3,98]
[null,null,null,null,19,7.1154999999999999,17.8855,1.7520911822343548E-2,99,null,19,7.4042999999999992,20.494299999999999,1.683751982927293E-2,99,null,19,7.3207000000000004,18.110700000000001,1.7029798799552694E-2,99,null,19,6.608200000000001,16.728200000000001,1.8865961694846622E-2,99,null,19,6.3707000000000003,19.4907,1.9569285647085172E-2,99,null,19,21.1907,79.080700000000007,5.8832435017194054E-3,99]
[null,null,null,null,19.5,7.3027500000000005,18.072749999999999,1.5913139137200556E-2,100,null,19.5,7.5991499999999998,20.689149999999998,1.5292457292485535E-2,100,null,19.5,7.51335,18.303349999999998,1.546709215385832E-2,100,null,19.5,6.7820999999999998,16.902099999999997,1.7134763102017298E-2,100,null,19.5,6.5383499999999994,19.658349999999999,1.777354788810501E-2,100,null,19.5,21.748350000000002,79.638350000000003,5.3433790073357888E-3,100]
[null,null,null,null,20,7.49,18.259999999999998,1.4416813488167717E-2,101,null,20,7.7939999999999996,20.884,1.3854494871231205E-2,101,null,20,7.7060000000000004,18.495999999999999,1.4012708671992754E-2,101,null,20,6.9560000000000004,17.076000000000001,1.5523567140077056E-2,101,null,20,6.7060000000000004,19.826000000000001,1.6102286463819861E-2,101,null,20,22.306000000000001,80.195999999999998,4.8409366549975862E-3,101]
[null,null,null,null,20.5,7.6772500000000008,18.44725,1.3028576389634904E-2,102,null,20.5,7.9888499999999993,21.078849999999999,1.2520405075489547E-2,102,null,20.5,7.8986500000000008,18.688649999999999,1.2663384007054962E-2,102,null,20.5,7.129900000000001,17.2499,1.4028757498327406E-2,102,null,20.5,6.8736500000000005,19.993649999999999,1.4551750247295783E-2,102,null,20.5,22.86365,80.753649999999993,4.3747887186571174E-3,102]
[null,null,null,null,21,7.8644999999999996,18.634499999999999,1.1744618419339716E-2,103,null,21,8.1836999999999982,21.273699999999998,1.1286527067084228E-2,103,null,21,8.0913000000000004,18.8813,1.1415415515293846E-2,103,null,21,7.3038000000000007,17.4238,1.2646232311796202E-2,103,null,21,7.0413000000000014,20.161300000000001,1.311768445583871E-2,103,null,21,23.421300000000002,81.311300000000003,3.9436560549114307E-3,103]
[null,null,null,null,21.5,8.0517500000000002,18.821750000000002,1.0560758768857193E-2,104,null,21.5,8.3785500000000006,21.46855,1.0148843107356991E-2,104,null,21.5,8.2839500000000008,19.07395,1.0264739576789571E-2,104,null,21.5,7.4777000000000005,17.5977,1.1371489818680339E-2,104,null,21.5,7.2089499999999997,20.328949999999999,1.1795419501750736E-2,104,null,21.5,23.978950000000001,81.868949999999998,3.5461348147915557E-3,104]
[null,null,null,null,22,8.2390000000000008,19.009,9.4725214542674026E-3,105,null,22,8.5733999999999995,21.663399999999999,9.1030517952864834E-3,105,null,22,8.4766000000000012,19.2666,9.2070056699276974E-3,105,null,22,7.6516000000000002,17.771599999999999,1.0199710421573161E-2,105,null,22,7.3766000000000007,20.496600000000001,1.0579956112803884E-2,105,null,22,24.5366,82.426600000000008,3.1807220340922967E-3,105]
[null,null,null,null,22.5,8.4262499999999996,19.196249999999999,8.4752074327549849E-3,106,null,22.5,8.7682499999999983,21.858249999999998,8.1446373712259299E-3,106,null,22.5,8.6692500000000017,19.459250000000001,8.2376464665630394E-3,106,null,22.5,7.8255000000000008,17.945499999999999,9.1258343403299077E-3,106,null,22.5,7.5442500000000008,20.664249999999999,9.4660458800081768E-3,106,null,22.5,25.094250000000002,82.984250000000003,2.8458398489794152E-3,106]
[null,null,null,null,23,8.6135000000000002,19.383499999999998,7.5639620137786939E-3,107,null,23,8.9631000000000007,22.053100000000001,7.2689344987429197E-3,107,null,23,8.8619000000000003,19.651899999999998,7.3519433536468224E-3,107,null,23,7.9993999999999996,18.119399999999999,8.1446341982752118E-3,107,null,23,7.7119,20.831899999999997,8.4482665498363287E-3,107,null,23,25.651900000000001,83.541899999999998,2.5398581315880199E-3,107]
[null,null,null,null,23.5,8.8007500000000007,19.57075,6.7338370935098478E-3,108,null,23.5,9.1579499999999996,22.247949999999999,6.4711880716434144E-3,108,null,23.5,9.0545500000000008,19.844549999999998,6.5450869232272025E-3,108,null,23.5,8.1733000000000011,18.293300000000002,7.2507820342709488E-3,108,null,23.5,7.8795500000000001,20.999549999999999,7.5210915345047353E-3,108,null,23.5,26.20955,84.099549999999994,2.2611153873571626E-3,108]
[null,null,null,null,24,8.9879999999999995,19.757999999999999,5.9798478757924958E-3,109,null,24,9.3527999999999984,22.442799999999998,5.7466077225668214E-3,109,null,24,9.2472000000000012,20.037199999999999,5.8122321035148968E-3,109,null,24,8.3472000000000008,18.467199999999998,6.4389103780456963E-3,109,null,24,8.0472000000000001,21.167200000000001,6.6789532641941185E-3,109,null,24,26.767200000000003,84.657200000000003,2.0079378010259929E-3,109]
[null,null,null,null,24.5,9.1752500000000001,19.945250000000001,5.2970238696382621E-3,110,null,24.5,9.5476500000000009,22.637650000000001,5.0904168313562516E-3,110,null,24.5,9.4398499999999999,20.229849999999999,5.1485477269128822E-3,110,null,24.5,8.5211000000000006,18.641100000000002,5.7036671626783473E-3,110,null,24.5,8.2148500000000002,21.334849999999999,5.9163001466732285E-3,110,null,24.5,27.324850000000005,85.214850000000013,1.7786563607814286E-3,110]
[null,null,null,null,25,9.3625000000000007,20.1325,4.6804540703787824E-3,111,null,25,9.7424999999999997,22.8325,4.4978959439488176E-3,111,null,25,9.6325000000000003,20.422499999999999,4.54926044473619E-3,111,null,25,8.6950000000000003,18.814999999999998,5.0397643742290258E-3,111,null,25,8.3825000000000003,21.502499999999998,5.2276470305900845E-3,111,null,25,27.8825,85.772500000000008,1.5716220293704405E-3,111]
[null,null,null,null,25.5,9.5497499999999995,20.319749999999999,4.1253263376222092E-3,112,null,25.5,9.9373499999999986,23.027349999999998,3.9644206144201118E-3,112,null,25.5,9.8251500000000007,20.61515,4.0096930014002488E-3,112,null,25.5,8.8689,18.988900000000001,4.4420204526725588E-3,112,null,25.5,8.5501500000000004,21.67015,4.6076191871145759E-3,112,null,25.5,28.440149999999999,86.330150000000003,1.3852189665915144E-3,112]
[null,null,null,null,26,9.7370000000000001,20.506999999999998,3.6269610770856163E-3,113,null,26,10.132199999999999,23.222200000000001,3.4854937730781632E-3,113,null,26,10.017800000000001,20.8078,3.5252969721478364E-3,113,null,26,9.0428000000000015,19.162800000000001,3.9053965594265704E-3,113,null,26,8.7178000000000004,21.837800000000001,4.0509899295215037E-3,113,null,26,28.997800000000002,86.887799999999999,1.2178758391182313E-3,113]
[null,null,null,null,26.5,9.9242500000000007,20.69425,3.1808394145808223E-3,114,null,26.5,10.32705,23.41705,3.0567728015409748E-3,114,null,26.5,10.21045,21.000450000000001,3.0916801473151231E-3,114,null,26.5,9.2166999999999994,19.3367,3.4250269142050514E-3,114,null,26.5,8.8854500000000005,22.00545,3.5527120810036322E-3,114,null,26.5,29.55545,87.445449999999994,1.0680752808755667E-3,114]
[null,null,null,null,27,10.111500000000001,20.881500000000003,2.782626118670915E-3,115,null,27,10.521899999999999,23.611899999999999,2.6740915613093674E-3,115,null,27,10.4031,21.193100000000001,2.7046288124636881E-3,115,null,27,9.3906000000000009,19.5106,2.9962434774073003E-3,115,null,27,9.0531000000000006,22.173099999999998,3.107943577221179E-3,115,null,27,30.113100000000003,88.003100000000003,9.3436159010334356E-4,115]
[null,null,null,null,27.5,10.29875,21.068750000000001,2.4281875838694368E-3,116,null,27.5,10.716749999999999,23.806750000000001,2.3334776755429927E-3,116,null,27.5,10.595750000000001,21.385750000000002,2.3601252275087053E-3,116,null,27.5,9.5645000000000007,19.6845,2.6145953138559668E-3,116,null,27.5,9.2207500000000007,22.34075,2.7120675519209819E-3,116,null,27.5,30.670750000000005,88.560750000000013,8.1534676782847918E-4,116]
[null,null,null,null,28,10.486000000000001,21.256,2.1136052291001223E-3,117,null,28,10.9116,24.0016,2.0311654049217239E-3,117,null,28,10.788399999999999,21.578399999999998,2.0543606496184704E-3,117,null,28,9.7384000000000004,19.8584,2.2758630198332283E-3,117,null,28,9.3884000000000007,22.508400000000002,2.3607073018132854E-3,117,null,28,31.228400000000001,89.118400000000008,7.0971501685465307E-4,117]
[null,null,null,null,28.5,10.673249999999999,21.443249999999999,1.8351846970931847E-3,118,null,28.5,11.106449999999999,24.196449999999999,1.7636044882252961E-3,118,null,28.5,10.98105,21.771049999999999,1.7837442747505781E-3,118,null,28.5,9.9123000000000001,20.032299999999999,1.9760686286986709E-3,118,null,28.5,9.5560500000000008,22.67605,2.0497365614715094E-3,118,null,28.5,31.786049999999999,89.676050000000004,6.1622583077324217E-4,118]
[null,null,null,null,29,10.8605,21.630499999999998,1.5894612602872801E-3,119,null,29,11.301299999999999,24.391300000000001,1.5274653373815368E-3,119,null,29,11.1737,21.963699999999999,1.5449084920259157E-3,119,null,29,10.086200000000002,20.206200000000003,1.7114814317929377E-3,119,null,29,9.7237000000000009,22.843699999999998,1.7752855412394462E-3,119,null,29,32.343699999999998,90.233699999999999,5.3371580917922117E-4,119]
[null,null,null,null,29.5,11.047750000000001,21.81775,1.3732018486125339E-3,120,null,29.5,11.49615,24.58615,1.3196409861570284E-3,120,null,29.5,11.366350000000001,22.15635,1.3347108546727068E-3,120,null,29.5,10.2601,20.380099999999999,1.4786201618901505E-3,120,null,29.5,9.8913499999999992,23.01135,1.5337431920828925E-3,120,null,29.5,32.901350000000001,90.791349999999994,4.610993385684526E-4,120]
[null,null,null,null,30,11.235000000000001,22.005000000000003,1.1834041153372485E-3,121,null,30,11.690999999999999,24.780999999999999,1.1372461924398275E-3,121,null,30,11.559000000000001,22.349,1.1502331720576193E-3,121,null,30,10.434000000000001,20.554000000000002,1.2742519873312247E-3,121,null,30,10.059000000000001,23.179000000000002,1.3217561622242766E-3,121,null,30,33.459000000000003,91.349000000000004,3.9736827866385788E-4,121]
[]
[]
[]
[]
[]
[]
[null,null,null,null,"Marque ","x","y",null,null,null,"Marque ","x","y",null,null,null,"Marque ","x","y",null,null,null,"Marque ","x","y",null,null,null,"Marque ","x","y",null,null,null,"Marque ","x","y"]
[null,null,null,null,"T1",{"$f":"VLOOKUP(F$274,G279:J399,3,TRUE)","v":62},{"$f":"VLOOKUP(F$274,G279:H399,2,TRUE)","v":0.10639356851662589},null,null,null,"T1",{"$f":"VLOOKUP(L$274,M279:P399,3,TRUE)","v":81},{"$f":"VLOOKUP(L$274,M279:N399,2,TRUE)","v":6.2091538239451745E-2},null,null,null,"T1",{"$f":"VLOOKUP(R$274,S279:V399,3,TRUE)","v":82},{"$f":"VLOOKUP(R$274,S279:T399,2,TRUE)","v":5.9663156159935893E-2},null,null,null,"T1",{"$f":"VLOOKUP(X$274,Y279:AB399,3,TRUE)","v":83},{"$f":"VLOOKUP(X$274,Y279:Z399,2,TRUE)","v":6.2637198686759807E-2},null,null,null,"T1",{"$f":"VLOOKUP(AD$274,AE279:AH399,3,TRUE)","v":24},{"$f":"VLOOKUP(AD$274,AE279:AF399,2,TRUE)","v":2.1492655632632873E-2},null,null,null,"T1",{"$f":"VLOOKUP(AJ$274,AK279:AN399,3,TRUE)","v":71},{"$f":"VLOOKUP(AJ$274,AK279:AL399,2,TRUE)","v":3.156687230021514E-2}]
[null,null,null,null,"T2",{"$f":"VLOOKUP(F$275,G279:J399,3,TRUE)","v":62},{"$f":"VLOOKUP(F$275,G279:H399,2,TRUE)","v":0.10639356851662589},null,null,"T2",null,{"$f":"VLOOKUP(L$275,M279:P399,3,TRUE)","v":45},{"$f":"VLOOKUP(L$275,M279:N399,2,TRUE)","v":7.4337067683213437E-2},null,null,null,"T2",{"$f":"VLOOKUP(R$275,S279:V399,3,TRUE)","v":56},{"$f":"VLOOKUP(R$275,S279:T399,2,TRUE)","v":0.1003550783293146},null,null,null,"T2",{"$f":"VLOOKUP(X$275,Y279:AB399,3,TRUE)","v":60},{"$f":"VLOOKUP(X$275,Y279:Z399,2,TRUE)","v":0.11456121739354916},null,null,null,"T2",{"$f":"VLOOKUP(AD$275,AE279:AH399,3,TRUE)","v":30},{"$f":"VLOOKUP(AD$275,AE279:AF399,2,TRUE)","v":3.5791530181027605E-2},null,null,null,"T2",{"$f":"VLOOKUP(AJ$275,AK279:AN399,3,TRUE)","v":45},{"$f":"VLOOKUP(AJ$275,AK279:AL399,2,TRUE)","v":2.5974316575045533E-2}]
[]
[null,null,null,null,"Moyenne norme","x","y",null,null,null,"Moyenne norme","x","y",null,null,null,"Moyenne norme","x","y",null,null,null,"Moyenne norme","x","y",null,null,null,"Moyenne norme","x","y",null,null,null,"Moyenne norme","x","y"]
[]
[]
[null,null,null,null,"Ecart sup","x","y",null,null,null,"Ecart sup","x","y",null,null,null,"Ecart sup","x","y",null,null,null,"Ecart sup","x","y",null,null,null,"Ecart sup","x","y",null,null,null,"Ecart sup","x","y"]
[null,null,null,null,null,71,0,null,null,null,null,71,0,null,null,null,null,71,0,null,null,null,null,71,0,null,null,null,null,71,0,null,null,null,null,71,0]
[null,null,null,null,null,71,{"$f":"VLOOKUP(5,E279:I399,4,TRUE)","v":9.4009433047877025E-2},null,null,null,null,71,{"$f":"VLOOKUP(5,K279:O399,4,TRUE)","v":9.0342655058840024E-2},null,null,null,null,71,{"$f":"VLOOKUP(5,Q279:U399,4,TRUE)","v":9.1374338635945879E-2},null,null,null,null,71,{"$f":"VLOOKUP(5,W279:AA399,4,TRUE)","v":0.10122637342274279},null,null,null,null,71,{"$f":"VLOOKUP(5,AC279:AG399,4,TRUE)","v":0.1050000974543094},null,null,null,null,71,{"$f":"VLOOKUP(5,AI279:AM399,4,TRUE)","v":3.156687230021514E-2}]
[null,null,null,null,"Ecart inf","x","y",null,null,null,"Ecart inf","x","y",null,null,null,"Ecart inf","x","y",null,null,null,"Ecart inf","x","y",null,null,null,"Ecart inf","x","y",null,null,null,"Ecart inf","x","y"]
[null,null,null,null,null,51,0,null,null,null,null,51,0,null,null,null,null,51,0,null,null,null,null,51,0,null,null,null,null,51,0,null,null,null,null,51,0]
[null,null,null,null,null,51,{"$f":"VLOOKUP(-5,E279:I399,4,TRUE)","v":9.4009433047877025E-2},null,null,null,null,51,{"$f":"VLOOKUP(-5,K279:O399,4,TRUE)","v":9.0342655058840024E-2},null,null,null,null,51,{"$f":"VLOOKUP(-5,Q279:U399,4,TRUE)","v":9.1374338635945879E-2},null,null,null,null,51,{"$f":"VLOOKUP(-5,W279:AA399,4,TRUE)","v":0.10122637342274279},null,null,null,null,51,{"$f":"VLOOKUP(-5,AC279:AG399,4,TRUE)","v":0.1050000974543094},null,null,null,null,51,{"$f":"VLOOKUP(-5,AI279:AM399,4,TRUE)","v":3.156687230021514E-2}]
[null,null,null,null,"Ecart 2 sup","x","y",null,null,null,"Ecart 2 sup","x","y",null,null,null,"Ecart 2 sup","x","y",null,null,null,"Ecart 2 sup","x","y",null,null,null,"Ecart 2 sup","x","y",null,null,null,"Ecart 2 sup","x","y"]
[null,null,null,null,null,91,0,null,null,null,null,91,0,null,null,null,null,91,0,null,null,null,null,91,0,null,null,null,null,91,0,null,null,null,null,91,0]
[null,null,null,null,null,91,{"$f":"VLOOKUP(15,E279:I399,4,TRUE)","v":3.4584137694497141E-2},null,null,null,null,91,{"$f":"VLOOKUP(15,K279:O399,4,TRUE)","v":3.3235205456990463E-2},null,null,null,null,91,{"$f":"VLOOKUP(15,Q279:U399,4,TRUE)","v":3.3614740634801923E-2},null,null,null,null,91,{"$f":"VLOOKUP(15,W279:AA399,4,TRUE)","v":3.7239101686570367E-2},null,null,null,null,91,{"$f":"VLOOKUP(15,AC279:AG399,4,TRUE)","v":3.8627377174438336E-2},null,null,null,null,91,{"$f":"VLOOKUP(15,AI279:AM399,4,TRUE)","v":1.1612803341333428E-2}]
[null,null,null,null,"Ecart 2 inf","x","y",null,null,null,"Ecart 2 inf","x","y",null,null,null,"Ecart 2 inf","x","y",null,null,null,"Ecart 2 inf","x","y",null,null,null,"Ecart 2 inf","x","y",null,null,null,"Ecart 2 inf","x","y"]
[null,null,null,null,null,31,0,null,null,null,null,31,0,null,null,null,null,31,0,null,null,null,null,31,0,null,null,null,null,31,0,null,null,null,null,31,0]
[null,null,null,null,null,31,{"$f":"VLOOKUP(-15,E279:J399,4,TRUE)","v":3.4584137694497107E-2},null,null,null,null,31,{"$f":"VLOOKUP(-15,K279:P399,4,TRUE)","v":3.3235205456990442E-2},null,null,null,null,31,{"$f":"VLOOKUP(-15,Q279:V399,4,TRUE)","v":3.3614740634801903E-2},null,null,null,null,31,{"$f":"VLOOKUP(-15,W279:AB399,4,TRUE)","v":3.7239101686570367E-2},null,null,null,null,31,{"$f":"VLOOKUP(-15,AC279:AH399,4,TRUE)","v":3.8627377174438336E-2},null,null,null,null,31,{"$f":"VLOOKUP(-15,AI279:AN399,4,TRUE)","v":1.1612803341333428E-2}]

{"sheet":"CERTS","index":9,"n_rows":419,"n_cols":15,"rows_kept":419,"cut":false,"hidden":false,"merged":[[6,1,6,8],[6,11,6,13],[2,1,2,8],[4,1,4,8],[4,11,4,13],[5,1,5,8],[5,11,5,13],[7,1,7,8],[7,11,7,13],[8,1,8,8],[8,11,8,13],[9,1,9,8],[9,11,9,13],[10,1,10,8],[10,11,10,13],[11,1,11,8],[11,11,11,13],[12,1,12,8],[12,11,12,13],[13,1,13,8],[13,11,13,13],[14,1,14,8],[14,11,14,13],[15,1,15,8],[15,11,15,13],[16,1,16,8],[16,11,16,13],[17,1,17,8],[17,11,17,13],[18,1,18,8],[18,11,18,13],[19,1,19,8],[19,11,19,13],[20,1,20,8],[20,11,20,13],[22,2,22,4],[22,5,22,7],[22,12,22,13]]}
[null,"Mini-Cambridge-Exeter Repetitive Thought Scale"]
[]
[null,"«  When thoughts about myself, feelings, situations or events do come to mind … »",null,null,null,null,null,null,null,null,"Almost never = 1","Sometimes = 2","Often = 3","Almost Always = 4"]
[]
[null,"Items",null,null,null,null,null,null,null,"Score T1","Score T2","Dimension"]
[null,"1. My thinking tends to get stuck in a rut, involving only a few themes. ",null,null,null,null,null,null,null,{"$f":"'Quest T1'!N208","v":3},{"$f":"'Quest T2'!N193","v":2},"Unconstructive rumination"]
[null,"2. I can grasp and respond to changes in the world around me without having to analyze the details",null,null,null,null,null,null,null,{"$f":"'Quest T1'!N209","v":3},{"$f":"'Quest T2'!N194","v":2},"Constructive rumination"]
[null,"3. I compare myself to other people",null,null,null,null,null,null,null,{"$f":"'Quest T1'!N210","v":4},{"$f":"'Quest T2'!N195","v":3},"Unconstructive rumination"]
[null,"4. My thinking tends to become open, loose, expansive and creative",null,null,null,null,null,null,null,{"$f":"'Quest T1'!N211","v":2},{"$f":"'Quest T2'!N196","v":1},"Constructive rumination"]
[null,"5. I judge myself against my own standards and beliefs",null,null,null,null,null,null,null,{"$f":"'Quest T1'!N212","v":3},{"$f":"'Quest T2'!N197","v":4},"Deleted item"]
[null,"6. I focus on why things happened the way they did",null,null,null,null,null,null,null,{"$f":"'Quest T1'!N213","v":2},{"$f":"'Quest T2'!N198","v":2},"Unconstructive rumination"]
[null,"7. I think about why I can’t get started on something",null,null,null,null,null,null,null,{"$f":"'Quest T1'!N214","v":1},{"$f":"'Quest T2'!N199","v":2},"Unconstructive rumination"]
[null,"8. My thoughts move in new and interesting directions ",null,null,null,null,null,null,null,{"$f":"'Quest T1'!N215","v":1},{"$f":"'Quest T2'!N200","v":2},"Constructive rumination"]
[null,"9. I seem to be engaged in and directly in touch with what is going on around me ",null,null,null,null,null,null,null,{"$f":"'Quest T1'!N216","v":2},{"$f":"'Quest T2'!N201","v":2},"Constructive rumination"]
[null,"10. I think I’m no good at all",null,null,null,null,null,null,null,{"$f":"'Quest T1'!N217","v":2},{"$f":"'Quest T2'!N202","v":1},"Unconstructive rumination"]
[null,"11. I’m relaxed about going with the flow of what comes to mind",null,null,null,null,null,null,null,{"$f":"'Quest T1'!N218","v":3},{"$f":"'Quest T2'!N203","v":3},"Constructive rumination"]
[null,"12. I feel under pressure to stop my worse fears happening",null,null,null,null,null,null,null,{"$f":"'Quest T1'!N219","v":4},{"$f":"'Quest T2'!N204","v":3},"Unconstructive rumination"]
[null,"13. I focus on exploring and playing with ideas, curious about where it will lead",null,null,null,null,null,null,null,{"$f":"'Quest T1'!N220","v":1},{"$f":"'Quest T2'!N205","v":2},"Constructive rumination"]
[null,"14. My thinking tends to spiral out from one specific event to broader, general aspects of my life ",null,null,null,null,null,null,null,{"$f":"'Quest T1'!N221","v":3},{"$f":"'Quest T2'!N206","v":2},"Unconstructive rumination"]
[null,"15. I am concerned about what other people might think of me ",null,null,null,null,null,null,null,{"$f":"'Quest T1'!N222","v":4},{"$f":"'Quest T2'!N207","v":3},"Unconstructive rumination"]
[null,"16. I have very rapid impressions and intuitions of what is happening around me ",null,null,null,null,null,null,null,{"$f":"'Quest T1'!N223","v":2},{"$f":"'Quest T2'!N208","v":2},"Constructive rumination"]
[]
[null,null,"T1",null,null,"T2",null,null,null,null,null,null,"Confidence level"]
[null,null,"Mean","Sum","Percentile","Mean","Sum","Percentile","d","Sdiff","RCI","d/SD","Two-tailed","One-tailed"]
[null,"Constructive rumination",{"$f":"AVERAGE(J7,J9,J13,J14,J16,J18,J21)","v":2},{"$f":"SUM(J7,J9,J13,J14,J16,J18,J21)","v":14},{"$f":"NORMDIST(D25,C54,D54,TRUE)*100","v":17.724223843665591},{"$f":"AVERAGE(K7,K9,K13,K14,K16,K18,K21)","v":2},{"$f":"SUM(K7,K9,K13,K14,K16,K18,K21)","v":14},{"$f":"NORMDIST(G25,C54,D54,TRUE)*100","v":17.724223843665591},{"$f":"G25-D25","v":0},{"$f":"SQRT(2*(D54*SQRT(1-E54))^2)","v":3.51},{"$f":"I25/J25","v":0},{"$f":"I25/D54","v":0},{"$f":"IF(ABS(K25)>0.84,(1-((1-_xlfn.NORM.S.DIST(ABS(K25),TRUE))*2)),\"no change\")","v":"no change"},{"$f":"IF(ABS(K25)>0.84,_xlfn.NORM.S.DIST(ABS(K25),TRUE),\"no change\")","v":"no change"}]
[null,"Unconstructive rumination",{"$f":"AVERAGE(J6,J8,J11,J12,J15,J17,J19,J20)","v":2.875},{"$f":"SUM(J6,J8,J11,J12,J15,J17,J19,J20)","v":23},{"$f":"NORMDIST(D26,C55,D55,TRUE)*100","v":83.246800347010691},{"$f":"AVERAGE(K6,K8,K11,K12,K15,K17,K19,K20)","v":2.25},{"$f":"SUM(K6,K8,K11,K12,K15,K17,K19,K20)","v":18},{"$f":"NORMDIST(G26,C55,D55,TRUE)*100","v":43.558907779173047},{"$f":"G26-D26","v":-5},{"$f":"SQRT(2*(D55*SQRT(1-E55))^2)","v":4.4400000000000004},{"$f":"I26/J26","v":-1.1261261261261259},{"$f":"I26/D55","v":-1.1261261261261259},{"$f":"IF(ABS(K26)>0.84,(1-((1-_xlfn.NORM.S.DIST(ABS(K26),TRUE))*2)),\"no change\")","v":0.73988786312569155},{"$f":"IF(ABS(K26)>0.84,_xlfn.NORM.S.DIST(ABS(K26),TRUE),\"no change\")","v":0.86994393156284577}]
[]
[]
[]
[]
[]
[]
[]
[]
[]
[]
[]
[]
[]
[]
[]
[]
[]
[]
[]
[]
[]
[]
[]
[]
[]
[null,"French norms"]
[null,"Normes (N=238)","M","SD","rxx"]
[null,"Constructive rumination",17.25,3.51,0.5]
[null,"Unconstructive rumination",18.72,4.4400000000000004,0.5]
[]
[]
[]
[]
[]
[]
[]
[]
[]
[]
[]
[]
[]
[]
[]
[]
[]
[]
[]
[]
[]
[]
[]
[]
[]
[]
[]
[]
[]
[]
[]
[]
[]
[]
[]
[]
[]
[]
[]
[]
[]
[]
[]
[]
[]
[]
[]
[]
[]
[]
[]
[]
[]
[]
[]
[]
[]
[]
[]
[]
[]
[]
[]
[]
[]
[]
[]
[]
[]
[]
[]
[]
[]
[]
[]
[]
[]
[]
[]
[]
[]
[]
[]
[]
[]
[]
[]
[]
[]
[]
[]
[]
[]
[]
[]
[]
[]
[]
[]
[]
[]
[]
[]
[]
[]
[]
[]
[]
[]
[]
[]
[]
[]
[]
[]
[]
[]
[]
[]
[]
[]
[]
[]
[]
[]
[]
[]
[]
[]
[]
[]
[]
[]
[]
[]
[]
[]
[]
[]
[]
[]
[]
[]
[]
[]
[]
[]
[]
[]
[]
[]
[]
[]
[]
[]
[]
[]
[]
[]
[]
[]
[]
[]
[]
[]
[]
[]
[]
[]
[]
[]
[]
[]
[]
[]
[]
[]
[]
[]
[]
[]
[]
[]
[]
[]
[]
[]
[]
[]
[]
[]
[]
[]
[]
[]
[]
[]
[]
[]
[]
[]
[]
[]
[]
[]
[]
[]
[]
[]
[]
[]
[null,null,null,null,"Dimension 1",null,null,null,null,null,"Dimension 2"]
[null,null,null,null,{"$f":"B25","v":"Constructive rumination"},null,null,null,null,null,{"$f":"B26","v":"Unconstructive rumination"}]
[null,null,null,null,"T1",{"$f":"D25","v":14},null,null,null,null,"T1",{"$f":"D26","v":23}]
[null,null,null,null,"T2",{"$f":"G25","v":14},null,null,null,null,"T2",{"$f":"G26","v":18}]
[null,null,null,null,"norme M",{"$f":"C54","v":17.25},null,null,null,null,"norme M",{"$f":"C55","v":18.72}]
[null,null,null,null,"norme SD",{"$f":"D55","v":4.4400000000000004},null,null,null,null,"norme SD",{"$f":"D55","v":4.4400000000000004}]
[null,null,null,null,null,null,"x","densité",null,null,null,null,"x","densité"]
[null,null,null,null,-30,{"$f":"E274*F$272/10","v":-13.320000000000002},{"$f":"F274+F$271","v":3.9299999999999979},{"$f":"NORMDIST(G274,F$271,F$272,FALSE)","v":9.9816405674279423E-4},1,null,-30,{"$f":"K274*L$272/10","v":-13.320000000000002},{"$f":"L274+L$271","v":5.3999999999999968},{"$f":"NORMDIST(M274,L$271,L$272,FALSE)","v":9.9816405674279423E-4},1]
[null,null,null,null,{"$f":"E274+0.5","v":-29.5},{"$f":"E275*F$272/10","v":-13.098000000000003},{"$f":"F275+F$271","v":4.1519999999999975},1.1582524601472836E-3,2,null,{"$f":"K274+0.5","v":-29.5},{"$f":"K275*L$272/10","v":-13.098000000000003},{"$f":"L275+L$271","v":5.6219999999999963},1.1582524601472836E-3,2]
[null,null,null,null,{"$f":"E275+0.5","v":-29},-12.876000000000001,4.3739999999999988,1.3406604549044713E-3,3,null,{"$f":"K275+0.5","v":-29},-12.876000000000001,5.8439999999999976,1.3406604549044713E-3,3]
[null,null,null,null,-28.5,-12.654,4.5960000000000001,1.5479204258139589E-3,4,null,-28.5,-12.654,6.0659999999999989,1.5479204258139589E-3,4]
[null,null,null,null,-28,-12.432,4.8179999999999996,1.7827593655360288E-3,5,null,-28,-12.432,6.2879999999999985,1.7827593655360288E-3,5]
[null,null,null,null,-27.5,-12.21,5.0399999999999991,2.048099662520507E-3,6,null,-27.5,-12.21,6.509999999999998,2.048099662520507E-3,6]
[null,null,null,null,-27,-11.988000000000001,5.2619999999999987,2.3470573906357183E-3,7,null,-27,-11.988000000000001,6.7319999999999975,2.3470573906357183E-3,7]
[null,null,null,null,-26.5,-11.766000000000002,5.4839999999999982,2.6829377494606232E-3,8,null,-26.5,-11.766000000000002,6.9539999999999971,2.6829377494606232E-3,8]
[null,null,null,null,-26,-11.544,5.7059999999999995,3.0592273048841469E-3,9,null,-26,-11.544,7.1759999999999984,3.0592273048841469E-3,9]
[null,null,null,null,-25.5,-11.322000000000001,5.927999999999999,3.4795826879268407E-3,10,null,-25.5,-11.322000000000001,7.3979999999999979,3.4795826879268407E-3,10]
[null,null,null,null,-25,-11.100000000000001,6.1499999999999986,3.9478154264794008E-3,11,null,-25,-11.100000000000001,7.6199999999999974,3.9478154264794008E-3,11]
[null,null,null,null,-24.5,-10.878000000000002,6.3719999999999981,4.46787261076471E-3,12,null,-24.5,-10.878000000000002,7.841999999999997,4.46787261076471E-3,12]
[null,null,null,null,-24,-10.656000000000001,6.5939999999999994,5.0438131294691215E-3,13,null,-24,-10.656000000000001,8.0639999999999983,5.0438131294691215E-3,13]
[null,null,null,null,-23.5,-10.434000000000001,6.8159999999999989,5.6797792601789143E-3,14,null,-23.5,-10.434000000000001,8.2859999999999978,5.6797792601789143E-3,14]
[null,null,null,null,-23,-10.212,7.0380000000000003,6.3799634553155819E-3,15,null,-23,-10.212,8.5079999999999991,6.3799634553155819E-3,15]
[null,null,null,null,-22.5,-9.99,7.26,7.1485702332584273E-3,16,null,-22.5,-9.99,8.7299999999999986,7.1485702332584273E-3,16]
[null,null,null,null,-22,-9.7680000000000007,7.4819999999999993,7.9897731635656354E-3,17,null,-22,-9.7680000000000007,8.9519999999999982,7.9897731635656354E-3,17]
[null,null,null,null,-21.5,-9.5460000000000012,7.7039999999999988,8.9076670246329322E-3,18,null,-21.5,-9.5460000000000012,9.1739999999999977,8.9076670246329322E-3,18]
[null,null,null,null,-21,-9.3240000000000016,7.9259999999999984,9.9062153109070253E-3,19,null,-21,-9.3240000000000016,9.3959999999999972,9.9062153109070253E-3,19]
[null,null,null,null,-20.5,-9.1020000000000003,8.1479999999999997,1.0989193373689811E-2,20,null,-20.5,-9.1020000000000003,9.6179999999999986,1.0989193373689811E-2,20]
[null,null,null,null,-20,-8.8800000000000008,8.3699999999999992,1.2160127593060373E-2,21,null,-20,-8.8800000000000008,9.8399999999999981,1.2160127593060373E-2,21]
[null,null,null,null,-19.5,-8.6580000000000013,8.5919999999999987,1.3422231096580192E-2,22,null,-19.5,-8.6580000000000013,10.061999999999998,1.3422231096580192E-2,22]
[null,null,null,null,-19,-8.4360000000000017,8.8139999999999983,1.4778336660963193E-2,23,null,-19,-8.4360000000000017,10.283999999999997,1.4778336660963193E-2,23]
[null,null,null,null,-18.5,-8.2140000000000004,9.0359999999999996,1.6230827553202258E-2,24,null,-18.5,-8.2140000000000004,10.505999999999998,1.6230827553202258E-2,24]
[null,null,null,null,-18,-7.992,9.2579999999999991,1.778156718488607E-2,25,null,-18,-7.992,10.727999999999998,1.778156718488607E-2,25]
[null,null,null,null,-17.5,-7.7700000000000005,9.48,1.943182856452963E-2,26,null,-17.5,-7.7700000000000005,10.95,1.943182856452963E-2,26]
[null,null,null,null,-17,-7.548,9.702,2.1182224634433994E-2,27,null,-17,-7.548,11.171999999999999,2.1182224634433994E-2,27]
[null,null,null,null,-16.5,-7.3260000000000005,9.9239999999999995,2.3032640667562616E-2,28,null,-16.5,-7.3260000000000005,11.393999999999998,2.3032640667562616E-2,28]
[null,null,null,null,-16,-7.104000000000001,10.145999999999999,2.4982169972850347E-2,29,null,-16,-7.104000000000001,11.615999999999998,2.4982169972850347E-2,29]
[null,null,null,null,-15.5,-6.8820000000000006,10.367999999999999,2.7029054211032778E-2,30,null,-15.5,-6.8820000000000006,11.837999999999997,2.7029054211032778E-2,30]
[null,null,null,null,-15,-6.660000000000001,10.59,2.9170629654480119E-2,31,null,-15,-6.660000000000001,12.059999999999999,2.9170629654480119E-2,31]
[null,null,null,null,-14.5,-6.4380000000000006,10.811999999999999,3.1403280730936997E-2,32,null,-14.5,-6.4380000000000006,12.281999999999998,3.1403280730936997E-2,32]
[null,null,null,null,-14,-6.2160000000000002,11.033999999999999,3.3722402170212801E-2,33,null,-14,-6.2160000000000002,12.503999999999998,3.3722402170212801E-2,33]
[null,null,null,null,-13.5,-5.9940000000000007,11.256,3.6122371022954868E-2,34,null,-13.5,-5.9940000000000007,12.725999999999999,3.6122371022954868E-2,34]
[null,null,null,null,-13,-5.7720000000000002,11.478,3.8596529740497147E-2,35,null,-13,-5.7720000000000002,12.947999999999999,3.8596529740497147E-2,35]
[null,null,null,null,-12.5,-5.5500000000000007,11.7,4.1137181393923854E-2,36,null,-12.5,-5.5500000000000007,13.169999999999998,4.1137181393923854E-2,36]
[null,null,null,null,-12,-5.3280000000000003,11.922000000000001,4.3735597969192123E-2,37,null,-12,-5.3280000000000003,13.391999999999999,4.3735597969192123E-2,37]
[null,null,null,null,-11.5,-5.1059999999999999,12.144,4.6382042504498823E-2,38,null,-11.5,-5.1059999999999999,13.613999999999999,4.6382042504498823E-2,38]
[null,null,null,null,-11,-4.8840000000000003,12.366,4.9065805637961826E-2,39,null,-11,-4.8840000000000003,13.835999999999999,4.9065805637961826E-2,39]
[null,null,null,null,-10.5,-4.6620000000000008,12.587999999999999,5.1775256910863279E-2,40,null,-10.5,-4.6620000000000008,14.057999999999998,5.1775256910863279E-2,40]
[null,null,null,null,-10,-4.4400000000000004,12.809999999999999,5.4497910927734976E-2,41,null,-10,-4.4400000000000004,14.279999999999998,5.4497910927734976E-2,41]
[null,null,null,null,-9.5,-4.2180000000000009,13.032,5.7220508213781308E-2,42,null,-9.5,-4.2180000000000009,14.501999999999999,5.7220508213781308E-2,42]
[null,null,null,null,-9,-3.996,13.254,5.9929110337557386E-2,43,null,-9,-3.996,14.723999999999998,5.9929110337557386E-2,43]
[null,null,null,null,-8.5,-3.774,13.475999999999999,6.2609208588062265E-2,44,null,-8.5,-3.774,14.945999999999998,6.2609208588062265E-2,44]
[null,null,null,null,-8,-3.5520000000000005,13.698,6.5245845216550177E-2,45,null,-8,-3.5520000000000005,15.167999999999999,6.5245845216550177E-2,45]
[null,null,null,null,-7.5,-3.3300000000000005,13.92,6.7823745980811798E-2,46,null,-7.5,-3.3300000000000005,15.389999999999999,6.7823745980811798E-2,46]
[null,null,null,null,-7,-3.1080000000000001,14.141999999999999,7.0327462469991275E-2,47,null,-7,-3.1080000000000001,15.611999999999998,7.0327462469991275E-2,47]
[null,null,null,null,-6.5,-2.8860000000000001,14.364000000000001,7.2741522447728454E-2,48,null,-6.5,-2.8860000000000001,15.834,7.2741522447728454E-2,48]
[null,null,null,null,-6,-2.6640000000000001,14.586,7.5050586236891814E-2,49,null,-6,-2.6640000000000001,16.055999999999997,7.50505862368918E-2,49]
[null,null,null,null,-5.5,-2.4420000000000002,14.808,7.7239606986347714E-2,50,null,-5.5,-2.4420000000000002,16.277999999999999,7.7239606986347714E-2,50]
[null,null,null,null,-5,-2.2200000000000002,15.03,7.9293992514481854E-2,51,null,-5,-2.2200000000000002,16.5,7.9293992514481881E-2,51]
[null,null,null,null,-4.5,-1.998,15.252000000000001,8.1199766320190991E-2,52,null,-4.5,-1.998,16.721999999999998,8.1199766320190964E-2,52]
[null,null,null,null,-4,-1.7760000000000002,15.474,8.2943725293541284E-2,53,null,-4,-1.7760000000000002,16.943999999999999,8.2943725293541284E-2,53]
[null,null,null,null,-3.5,-1.554,15.696,8.4513591647958977E-2,54,null,-3.5,-1.554,17.166,8.4513591647958991E-2,54]
[null,null,null,null,-3,-1.3320000000000001,15.917999999999999,8.5898156635253159E-2,55,null,-3,-1.3320000000000001,17.387999999999998,8.5898156635253159E-2,55]
[null,null,null,null,-2.5,-1.1100000000000001,16.14,8.7087413694335411E-2,56,null,-2.5,-1.1100000000000001,17.61,8.7087413694335411E-2,56]
[null,null,null,null,-2,-0.88800000000000012,16.361999999999998,8.8072678823300873E-2,57,null,-2,-0.88800000000000012,17.831999999999997,8.8072678823300873E-2,57]
[null,null,null,null,-1.5,-0.66600000000000004,16.584,8.8846696150425439E-2,58,null,-1.5,-0.66600000000000004,18.053999999999998,8.8846696150425439E-2,58]
[null,null,null,null,-1,-0.44400000000000006,16.806000000000001,8.9403726909236883E-2,59,null,-1,-0.44400000000000006,18.276,8.9403726909236883E-2,59]
[null,null,null,null,-0.5,-0.22200000000000003,17.027999999999999,8.9739620291613503E-2,60,null,-0.5,-0.22200000000000003,18.497999999999998,8.9739620291613503E-2,60]
[null,null,null,null,0,0,17.25,8.9851864955277624E-2,61,null,0,0,18.72,8.9851864955277624E-2,61]
[null,null,null,null,0.5,0.22200000000000003,17.472000000000001,8.9739620291613503E-2,62,null,0.5,0.22200000000000003,18.942,8.9739620291613503E-2,62]
[null,null,null,null,1,0.44400000000000006,17.693999999999999,8.9403726909236883E-2,63,null,1,0.44400000000000006,19.163999999999998,8.9403726909236883E-2,63]
[null,null,null,null,1.5,0.66600000000000004,17.916,8.8846696150425439E-2,64,null,1.5,0.66600000000000004,19.385999999999999,8.8846696150425439E-2,64]
[null,null,null,null,2,0.88800000000000012,18.138000000000002,{"$f":"NORMDIST(G338,F$271,F$272,FALSE)","v":8.8072678823300873E-2},65,null,2,0.88800000000000012,19.608000000000001,{"$f":"NORMDIST(M338,L$271,L$272,FALSE)","v":8.8072678823300873E-2},65]
[null,null,null,null,2.5,{"$f":"E339*F$272/10","v":1.1100000000000001},{"$f":"F339+F$271","v":18.36},8.7087413694335411E-2,66,null,2.5,{"$f":"K339*L$272/10","v":1.1100000000000001},{"$f":"L339+L$271","v":19.829999999999998},8.7087413694335411E-2,66]
[null,null,null,null,{"$f":"E339+0.5","v":3},1.3320000000000001,18.582000000000001,8.5898156635253159E-2,67,null,{"$f":"K339+0.5","v":3},1.3320000000000001,20.052,8.5898156635253159E-2,67]
[null,null,null,null,{"$f":"E340+0.5","v":3.5},1.554,18.803999999999998,8.4513591647958991E-2,68,null,{"$f":"K340+0.5","v":3.5},1.554,20.273999999999997,8.4513591647958991E-2,68]
[null,null,null,null,{"$f":"E341+0.5","v":4},1.7760000000000002,19.026,8.2943725293541284E-2,69,null,{"$f":"K341+0.5","v":4},1.7760000000000002,20.495999999999999,8.2943725293541284E-2,69]
[null,null,null,null,{"$f":"E342+0.5","v":4.5},1.998,19.248000000000001,8.1199766320190964E-2,70,null,{"$f":"K342+0.5","v":4.5},1.998,20.718,8.1199766320190964E-2,70]
[null,null,null,null,5,2.2200000000000002,19.47,7.9293992514481881E-2,71,null,5,2.2200000000000002,20.939999999999998,7.9293992514481881E-2,71]
[null,null,null,null,5.5,2.4420000000000002,19.692,7.7239606986347714E-2,72,null,5.5,2.4420000000000002,21.161999999999999,7.7239606986347714E-2,72]
[null,null,null,null,6,2.6640000000000001,19.914000000000001,7.50505862368918E-2,73,null,6,2.6640000000000001,21.384,7.50505862368918E-2,73]
[null,null,null,null,6.5,2.8860000000000001,20.135999999999999,7.2741522447728454E-2,74,null,6.5,2.8860000000000001,21.605999999999998,7.2741522447728454E-2,74]
[null,null,null,null,7,3.1080000000000001,20.358000000000001,7.0327462469991275E-2,75,null,7,3.1080000000000001,21.827999999999999,7.0327462469991275E-2,75]
[null,null,null,null,7.5,3.3300000000000005,20.580000000000002,6.7823745980811784E-2,76,null,7.5,3.3300000000000005,22.05,6.7823745980811784E-2,76]
[null,null,null,null,8,3.5520000000000005,20.802,6.5245845216550177E-2,77,null,8,3.5520000000000005,22.271999999999998,6.5245845216550177E-2,77]
[null,null,null,null,8.5,3.774,21.024000000000001,6.2609208588062265E-2,78,null,8.5,3.774,22.494,6.2609208588062265E-2,78]
[null,null,null,null,9,3.996,21.245999999999999,5.9929110337557413E-2,79,null,9,3.996,22.715999999999998,5.9929110337557413E-2,79]
[null,null,null,null,9.5,4.2180000000000009,21.468,5.7220508213781308E-2,80,null,9.5,4.2180000000000009,22.937999999999999,5.7220508213781308E-2,80]
[null,null,null,null,10,4.4400000000000004,21.69,5.4497910927734976E-2,81,null,10,4.4400000000000004,23.16,5.4497910927734976E-2,81]
[null,null,null,null,10.5,4.6620000000000008,21.911999999999999,5.1775256910863314E-2,82,null,10.5,4.6620000000000008,23.381999999999998,5.1775256910863314E-2,82]
[null,null,null,null,11,4.8840000000000003,22.134,4.9065805637961826E-2,83,null,11,4.8840000000000003,23.603999999999999,4.9065805637961826E-2,83]
[null,null,null,null,11.5,5.1059999999999999,22.356000000000002,4.6382042504498788E-2,84,null,11.5,5.1059999999999999,23.826000000000001,4.6382042504498788E-2,84]
[null,null,null,null,{"$f":"E357+0.5","v":12},5.3280000000000003,22.577999999999999,4.3735597969192123E-2,85,null,{"$f":"K357+0.5","v":12},5.3280000000000003,24.047999999999998,4.3735597969192123E-2,85]
[null,null,null,null,{"$f":"E358+0.5","v":12.5},5.5500000000000007,22.8,4.1137181393923854E-2,86,null,{"$f":"K358+0.5","v":12.5},5.5500000000000007,24.27,4.1137181393923854E-2,86]
[null,null,null,null,13,5.7720000000000002,23.021999999999998,3.8596529740497168E-2,87,null,13,5.7720000000000002,24.491999999999997,3.8596529740497168E-2,87]
[null,null,null,null,13.5,5.9940000000000007,23.244,3.6122371022954868E-2,88,null,13.5,5.9940000000000007,24.713999999999999,3.6122371022954868E-2,88]
[null,null,null,null,14,6.2160000000000002,23.466000000000001,3.3722402170212801E-2,89,null,14,6.2160000000000002,24.936,3.3722402170212801E-2,89]
[null,null,null,null,14.5,6.4380000000000006,23.688000000000002,3.1403280730936969E-2,90,null,14.5,6.4380000000000006,25.158000000000001,3.1403280730936969E-2,90]
[null,null,null,null,15,6.660000000000001,23.91,2.9170629654480119E-2,91,null,15,6.660000000000001,25.38,2.9170629654480119E-2,91]
[null,null,null,null,15.5,6.8820000000000006,24.132000000000001,2.7029054211032778E-2,92,null,15.5,6.8820000000000006,25.602,2.7029054211032778E-2,92]
[null,null,null,null,16,7.104000000000001,24.353999999999999,2.4982169972850365E-2,93,null,16,7.104000000000001,25.823999999999998,2.4982169972850365E-2,93]
[null,null,null,null,16.5,7.3260000000000005,24.576000000000001,2.3032640667562616E-2,94,null,16.5,7.3260000000000005,26.045999999999999,2.3032640667562616E-2,94]
[null,null,null,null,17,7.548,24.798000000000002,2.1182224634433984E-2,95,null,17,7.548,26.268000000000001,2.1182224634433984E-2,95]
[null,null,null,null,17.5,7.7700000000000005,25.02,1.943182856452963E-2,96,null,17.5,7.7700000000000005,26.49,1.943182856452963E-2,96]
[null,null,null,null,18,7.992,25.242000000000001,1.778156718488607E-2,97,null,18,7.992,26.712,1.778156718488607E-2,97]
[null,null,null,null,18.5,8.2140000000000004,25.463999999999999,1.6230827553202268E-2,98,null,18.5,8.2140000000000004,26.933999999999997,1.6230827553202268E-2,98]
[null,null,null,null,19,8.4360000000000017,25.686,1.4778336660963197E-2,99,null,19,8.4360000000000017,27.155999999999999,1.4778336660963197E-2,99]
[null,null,null,null,19.5,8.6580000000000013,25.908000000000001,1.3422231096580192E-2,100,null,19.5,8.6580000000000013,27.378,1.3422231096580192E-2,100]
[null,null,null,null,20,8.8800000000000008,26.130000000000003,1.2160127593060359E-2,101,null,20,8.8800000000000008,27.6,1.2160127593060359E-2,101]
[null,null,null,null,20.5,9.1020000000000003,26.352,1.0989193373689811E-2,102,null,20.5,9.1020000000000003,27.821999999999999,1.0989193373689811E-2,102]
[null,null,null,null,21,9.3240000000000016,26.574000000000002,9.9062153109070253E-3,103,null,21,9.3240000000000016,28.044,9.9062153109070253E-3,103]
[null,null,null,null,21.5,9.5460000000000012,26.795999999999999,8.9076670246329408E-3,104,null,21.5,9.5460000000000012,28.265999999999998,8.9076670246329408E-3,104]
[null,null,null,null,22,9.7680000000000007,27.018000000000001,7.9897731635656354E-3,105,null,22,9.7680000000000007,28.488,7.9897731635656354E-3,105]
[null,null,null,null,22.5,9.99,27.240000000000002,7.1485702332584203E-3,106,null,22.5,9.99,28.71,7.1485702332584203E-3,106]
[null,null,null,null,23,10.212,27.462,6.3799634553155819E-3,107,null,23,10.212,28.931999999999999,6.3799634553155819E-3,107]
[null,null,null,null,23.5,10.434000000000001,27.684000000000001,5.6797792601789143E-3,108,null,23.5,10.434000000000001,29.154,5.6797792601789143E-3,108]
[null,null,null,null,24,10.656000000000001,27.905999999999999,5.0438131294691284E-3,109,null,24,10.656000000000001,29.375999999999998,5.0438131294691284E-3,109]
[null,null,null,null,24.5,10.878000000000002,28.128,4.4678726107647152E-3,110,null,24.5,10.878000000000002,29.597999999999999,4.4678726107647152E-3,110]
[null,null,null,null,25,11.100000000000001,28.35,3.9478154264794008E-3,111,null,25,11.100000000000001,29.82,3.9478154264794008E-3,111]
[null,null,null,null,25.5,11.322000000000001,28.572000000000003,3.4795826879268372E-3,112,null,25.5,11.322000000000001,30.042000000000002,3.4795826879268372E-3,112]
[null,null,null,null,26,11.544,28.794,3.0592273048841469E-3,113,null,26,11.544,30.263999999999999,3.0592273048841469E-3,113]
[null,null,null,null,26.5,11.766000000000002,29.016000000000002,2.6829377494606232E-3,114,null,26.5,11.766000000000002,30.486000000000001,2.6829377494606232E-3,114]
[null,null,null,null,27,11.988000000000001,29.238,2.3470573906357217E-3,115,null,27,11.988000000000001,30.707999999999998,2.3470573906357217E-3,115]
[null,null,null,null,27.5,12.21,29.46,2.048099662520507E-3,116,null,27.5,12.21,30.93,2.048099662520507E-3,116]
[null,null,null,null,28,12.432,29.682000000000002,1.7827593655360264E-3,117,null,28,12.432,31.152000000000001,1.7827593655360264E-3,117]
[null,null,null,null,28.5,12.654,29.904,1.5479204258139589E-3,118,null,28.5,12.654,31.373999999999999,1.5479204258139589E-3,118]
[null,null,null,null,29,12.876000000000001,30.126000000000001,1.3406604549044713E-3,119,null,29,12.876000000000001,31.596,1.3406604549044713E-3,119]
[null,null,null,null,29.5,13.098000000000003,30.348000000000003,1.1582524601472836E-3,120,null,29.5,13.098000000000003,31.818000000000001,1.1582524601472836E-3,120]
[null,null,null,null,30,13.320000000000002,30.57,9.9816405674279423E-4,121,null,30,13.320000000000002,32.04,9.9816405674279423E-4,121]
[]
[]
[]
[]
[]
[]
[null,null,null,null,"Marque ","x","y",null,null,null,"Marque ","x","y"]
[null,null,null,null,"T1",{"$f":"VLOOKUP(F$269,G274:J394,3,TRUE)","v":46},{"$f":"VLOOKUP(F$269,G274:H394,2,TRUE)","v":6.7823745980811798E-2},null,null,null,"T1",{"$f":"VLOOKUP(L$269,M274:P394,3,TRUE)","v":80},{"$f":"VLOOKUP(L$269,M274:N394,2,TRUE)","v":5.7220508213781308E-2}]
[null,null,null,null,"T2",{"$f":"VLOOKUP(F$270,G274:J394,3,TRUE)","v":46},{"$f":"VLOOKUP(F$270,G274:H394,2,TRUE)","v":6.7823745980811798E-2},null,null,null,"T2",{"$f":"VLOOKUP(L$270,M274:P394,3,TRUE)","v":57},{"$f":"VLOOKUP(L$270,M274:N394,2,TRUE)","v":8.8072678823300873E-2}]
[]
[null,null,null,null,"Moyenne norme","x","y",null,null,null,"Moyenne norme","x","y"]
[]
[]
[null,null,null,null,"Ecart sup","x","y",null,null,null,"Ecart sup","x","y"]
[null,null,null,null,null,71,0,null,null,null,null,71,0]
[null,null,null,null,null,71,{"$f":"VLOOKUP(5,E274:I394,4,TRUE)","v":7.9293992514481881E-2},null,null,null,null,71,{"$f":"VLOOKUP(5,K274:O394,4,TRUE)","v":7.9293992514481881E-2}]
[null,null,null,null,"Ecart inf","x","y",null,null,null,"Ecart inf","x","y"]
[null,null,null,null,null,51,0,null,null,null,null,51,0]
[null,null,null,null,null,51,{"$f":"VLOOKUP(-5,E274:I394,4,TRUE)","v":7.9293992514481854E-2},null,null,null,null,51,{"$f":"VLOOKUP(-5,K274:O394,4,TRUE)","v":7.9293992514481881E-2}]
[null,null,null,null,"Ecart 2 sup","x","y",null,null,null,"Ecart 2 sup","x","y"]
[null,null,null,null,null,91,0,null,null,null,null,91,0]
[null,null,null,null,null,91,{"$f":"VLOOKUP(15,E274:I394,4,TRUE)","v":2.9170629654480119E-2},null,null,null,null,91,{"$f":"VLOOKUP(15,K274:O394,4,TRUE)","v":2.9170629654480119E-2}]
[null,null,null,null,"Ecart 2 inf","x","y",null,null,null,"Ecart 2 inf","x","y"]
[null,null,null,null,null,31,0,null,null,null,null,31,0]
[null,null,null,null,null,31,{"$f":"VLOOKUP(-15,E274:J394,4,TRUE)","v":2.9170629654480119E-2},null,null,null,null,31,{"$f":"VLOOKUP(-15,K274:P394,4,TRUE)","v":2.9170629654480119E-2}]

{"sheet":"SE","index":10,"n_rows":22,"n_cols":5,"rows_kept":22,"cut":false,"hidden":false,"merged":[[2,0,2,1],[9,0,9,1],[10,0,10,1],[11,0,11,1],[12,0,12,1],[13,0,13,1],[14,0,14,1],[3,0,3,1],[4,0,4,1],[5,0,5,1],[6,0,6,1],[7,0,7,1],[8,0,8,1]]}
["Self-Efficacy"]
[]
["Item"]
["I have confidence in my ability to handle things … ",null,"Score T1","Score T2","d"]
["…in the relationships within family",null,{"$f":"'Quest T1'!N231","v":25},{"$f":"'Quest T2'!N216","v":20},{"$f":"D5-C5","v":-5}]
["…in the relationships within my couple",null,{"$f":"'Quest T1'!N232","v":75},{"$f":"'Quest T2'!N217","v":75},{"$f":"D6-C6","v":0}]
["…in the relationships with my friends",null,{"$f":"'Quest T1'!N233","v":60},{"$f":"'Quest T2'!N218","v":60},0]
["…in my professional relationships",null,{"$f":"'Quest T1'!N234","v":60},{"$f":"'Quest T2'!N219","v":60},0]
["…as a parent",null,{"$f":"'Quest T1'!N235","v":80},{"$f":"'Quest T2'!N220","v":85},5]
["…in my sexual life",null,{"$f":"'Quest T1'!N236","v":50},{"$f":"'Quest T2'!N221","v":75},25]
["…in my profession or my studies",null,{"$f":"'Quest T1'!N237","v":75},{"$f":"'Quest T2'!N222","v":65},-10]
["…in the regulation of  my emotions",null,{"$f":"'Quest T1'!N238","v":20},{"$f":"'Quest T2'!N223","v":10},-10]
["...in my free time, my hobbies",null,{"$f":"'Quest T1'!N239","v":10},{"$f":"'Quest T2'!N224","v":20},10]
["…in daily tasks / housework",null,{"$f":"'Quest T1'!N240","v":20},{"$f":"'Quest T2'!N225","v":85},65]
["Possibly, other(s) fields that you may consider significant(s) :"]
["…in",{"$f":"IF('Quest T2'!C227=0, \" \", 'Quest T2'!C227)","v":" "},{"$f":"'Quest T1'!N242","v":"VIDE"},{"$f":"'Quest T2'!N227","v":"VIDE"},{"$error":"#VALUE!"}]
["…in",{"$f":"IF('Quest T2'!C228=0, \" \", 'Quest T2'!C228)","v":" "},{"$f":"'Quest T1'!N243","v":"VIDE"},{"$f":"'Quest T2'!N228","v":"VIDE"},{"$error":"#VALUE!"}]
["…in",{"$f":"IF('Quest T2'!C229=0, \" \", 'Quest T2'!C229)","v":" "},{"$f":"'Quest T1'!N244","v":"VIDE"},{"$f":"'Quest T2'!N229","v":"VIDE"},{"$error":"#VALUE!"}]
[]
[]
[null,null,"T1","T2"]
["Mean",null,{"$f":"AVERAGE(C5:C18)","v":47.5},{"$f":"AVERAGE(D5:D18)","v":55.5}]

{"sheet":"Self-Discr","index":11,"n_rows":428,"n_cols":27,"rows_kept":428,"cut":false,"hidden":false,"merged":[[6,8,6,10],[7,8,7,10],[6,12,6,14],[7,12,7,14],[19,12,19,14],[19,8,19,10],[16,8,16,15],[11,12,11,14],[12,12,12,14],[8,12,8,14],[9,12,9,14],[10,12,10,14],[8,8,8,10],[9,8,9,10],[10,8,10,10],[11,8,11,10],[6,0,6,2],[7,0,7,2],[6,4,6,6],[7,4,7,6],[19,4,19,6],[16,0,16,7],[17,4,17,6],[18,4,18,6],[8,0,8,2],[9,0,9,2],[10,0,10,2],[11,0,11,2],[12,0,12,2],[8,4,8,6],[9,4,9,6],[10,4,10,6],[36,10,36,11],[30,2,30,4],[21,12,21,14],[22,12,22,14],[23,0,23,2],[24,0,24,2],[25,0,25,2],[21,0,21,2],[22,0,22,2],[23,12,23,14],[24,4,24,6],[25,4,25,6],[23,8,23,10],[24,8,24,10],[25,8,25,10],[23,4,23,6],[24,12,24,14],[25,12,25,14],[21,8,21,10],[22,8,22,10],[21,4,21,6],[22,4,22,6],[3,0,3,7],[3,8,3,15],[2,0,2,15],[4,12,4,14],[5,12,5,14],[4,0,4,2],[5,0,5,2],[4,4,4,6],[5,4,5,6],[4,8,4,10],[5,8,5,10],[11,4,11,6],[12,4,12,6],[75,0,76,0],[77,0,78,0],[38,0,39,0],[40,0,41,0],[34,2,34,4],[36,2,36,3],[36,4,36,5],[20,12,20,14],[20,8,20,10],[12,8,12,10],[17,0,17,2],[18,0,18,2],[15,0,15,15],[17,12,17,14],[18,12,18,14],[17,8,17,10],[18,8,18,10],[19,0,19,2],[20,0,20,2],[20,4,20,6]]}
["Self-discrepancies Questionnaire"]
[]
["Ideal Self"]
["T1",null,null,null,null,null,null,null,"T2"]
["Features I would like to have: ",null,null,"%","Features I wouldn’t like to have :",null,null,"%","Features I would like to have: ",null,null,"%","Features I wouldn’t like to have :",null,null,"%"]
[{"$f":"IF('Quest T1'!B252=0, \" \",'Quest T1'!B252)","v":"Calm, philosoph"},null,null,{"$f":"IF('Quest T1'!G252=0, \" \",'Quest T1'!G252)","v":0.3},{"$f":"IF('Quest T1'!H252=0, \" \",'Quest T1'!H252)","v":"Selfish"},null,null,{"$f":"IF('Quest T1'!I252=0, \" \",'Quest T1'!I252)","v":0.1},{"$f":"IF('Quest T2'!B237=0, \" \", 'Quest T2'!B237)","v":"Calm"},null,null,{"$f":"IF('Quest T2'!G237=0, \" \", 'Quest T2'!G237)","v":0.25},{"$f":"IF('Quest T2'!H237=0, \" \", 'Quest T2'!H237)","v":"Unfair"},null,null,{"$f":"IF('Quest T2'!I237=0, \" \", 'Quest T2'!I237)","v":0.1}]
[{"$f":"IF('Quest T1'!B253=0, \" \",'Quest T1'!B253)","v":"Erudite"},null,null,{"$f":"IF('Quest T1'!G253=0, \" \",'Quest T1'!G253)","v":0.4},{"$f":"IF('Quest T1'!H253=0, \" \",'Quest T1'!H253)","v":"Disdainful"},null,null,{"$f":"IF('Quest T1'!I253=0, \" \",'Quest T1'!I253)","v":" "},{"$f":"IF('Quest T2'!B238=0, \" \", 'Quest T2'!B238)","v":"Clever"},null,null,{"$f":"IF('Quest T2'!G238=0, \" \", 'Quest T2'!G238)","v":0.35},{"$f":"IF('Quest T2'!H238=0, \" \", 'Quest T2'!H238)","v":"Dishonest"},null,null,{"$f":"IF('Quest T2'!I238=0, \" \", 'Quest T2'!I238)","v":0.01}]
[{"$f":"IF('Quest T1'!B254=0, \" \",'Quest T1'!B254)","v":"Well-organized"},null,null,{"$f":"IF('Quest T1'!G254=0, \" \",'Quest T1'!G254)","v":0.5},{"$f":"IF('Quest T1'!H254=0, \" \",'Quest T1'!H254)","v":"Dishonest"},null,null,{"$f":"IF('Quest T1'!I254=0, \" \",'Quest T1'!I254)","v":0.05},{"$f":"IF('Quest T2'!B239=0, \" \", 'Quest T2'!B239)","v":"Efficient"},null,null,{"$f":"IF('Quest T2'!G239=0, \" \", 'Quest T2'!G239)","v":0.5},{"$f":"IF('Quest T2'!H239=0, \" \", 'Quest T2'!H239)","v":"Disdainfull"},null,null,{"$f":"IF('Quest T2'!I239=0, \" \", 'Quest T2'!I239)","v":0.1}]
[{"$f":"IF('Quest T1'!B255=0, \" \",'Quest T1'!B255)","v":" "},null,null,{"$f":"IF('Quest T1'!G255=0, \" \",'Quest T1'!G255)","v":" "},{"$f":"IF('Quest T1'!H255=0, \" \",'Quest T1'!H255)","v":" "},null,null,{"$f":"IF('Quest T1'!I255=0, \" \",'Quest T1'!I255)","v":" "},{"$f":"IF('Quest T2'!B240=0, \" \", 'Quest T2'!B240)","v":"Liked"},null,null,{"$f":"IF('Quest T2'!G240=0, \" \", 'Quest T2'!G240)","v":0.4},{"$f":"IF('Quest T2'!H240=0, \" \", 'Quest T2'!H240)","v":"Stupid"},null,null,{"$f":"IF('Quest T2'!I240=0, \" \", 'Quest T2'!I240)","v":0.4}]
[{"$f":"IF('Quest T1'!B256=0, \" \",'Quest T1'!B256)","v":" "},null,null,{"$f":"IF('Quest T1'!G256=0, \" \",'Quest T1'!G256)","v":" "},{"$f":"IF('Quest T1'!H256=0, \" \",'Quest T1'!H256)","v":" "},null,null,{"$f":"IF('Quest T1'!I256=0, \" \",'Quest T1'!I256)","v":" "},{"$f":"IF('Quest T2'!B241=0, \" \", 'Quest T2'!B241)","v":"Altruistic"},null,null,{"$f":"IF('Quest T2'!G241=0, \" \", 'Quest T2'!G241)","v":0.7},{"$f":"IF('Quest T2'!H241=0, \" \", 'Quest T2'!H241)","v":"Self-important"},null,null,{"$f":"IF('Quest T2'!I241=0, \" \", 'Quest T2'!I241)","v":0.1}]
[{"$f":"IF('Quest T1'!B257=0, \" \",'Quest T1'!B257)","v":" "},null,null,{"$f":"IF('Quest T1'!G257=0, \" \",'Quest T1'!G257)","v":" "},{"$f":"IF('Quest T1'!H257=0, \" \",'Quest T1'!H257)","v":" "},null,null,{"$f":"IF('Quest T1'!I257=0, \" \",'Quest T1'!I257)","v":" "},{"$f":"IF('Quest T2'!B242=0, \" \", 'Quest T2'!B242)","v":" "},null,null,{"$f":"IF('Quest T2'!G242=0, \" \", 'Quest T2'!G242)","v":" "},{"$f":"IF('Quest T2'!H242=0, \" \", 'Quest T2'!H242)","v":" "},null,null,{"$f":"IF('Quest T2'!I242=0, \" \", 'Quest T2'!I242)","v":" "}]
[{"$f":"IF('Quest T1'!B258=0, \" \",'Quest T1'!B258)","v":" "},null,null,{"$f":"IF('Quest T1'!G258=0, \" \",'Quest T1'!G258)","v":" "},{"$f":"IF('Quest T1'!H258=0, \" \",'Quest T1'!H258)","v":" "},null,null,{"$f":"IF('Quest T1'!I258=0, \" \",'Quest T1'!I258)","v":" "},{"$f":"IF('Quest T2'!B243=0, \" \", 'Quest T2'!B243)","v":" "},null,null,{"$f":"IF('Quest T2'!G243=0, \" \", 'Quest T2'!G243)","v":" "},{"$f":"IF('Quest T2'!H243=0, \" \", 'Quest T2'!H243)","v":" "},null,null,{"$f":"IF('Quest T2'!I243=0, \" \", 'Quest T2'!I243)","v":" "}]
[{"$f":"IF('Quest T1'!B259=0, \" \",'Quest T1'!B259)","v":" "},null,null,{"$f":"IF('Quest T1'!G259=0, \" \",'Quest T1'!G259)","v":" "},{"$f":"IF('Quest T1'!H259=0, \" \",'Quest T1'!H259)","v":" "},null,null,{"$f":"IF('Quest T1'!I259=0, \" \",'Quest T1'!I259)","v":" "},{"$f":"IF('Quest T2'!B244=0, \" \", 'Quest T2'!B244)","v":" "},null,null,{"$f":"IF('Quest T2'!G244=0, \" \", 'Quest T2'!G244)","v":" "},{"$f":"IF('Quest T2'!H244=0, \" \", 'Quest T2'!H244)","v":" "},null,null,{"$f":"IF('Quest T2'!I244=0, \" \", 'Quest T2'!I244)","v":" "}]
[]
[]
["Ought self"]
["T1",null,null,null,null,null,null,null,"T2"]
["Features that the important people to me think I should have :",null,null,"%","Features that the important people to me think that I should not have :",null,null,"%","Features that the important people to me think I should have :",null,null,"%","Features that the important people to me think that I should not have :",null,null,"%"]
[{"$f":"IF('Quest T1'!B272=0, \" \",'Quest T1'!B272)","v":"Calm"},null,null,{"$f":"IF('Quest T1'!G272=0, \" \",'Quest T1'!G272)","v":0.3},{"$f":"IF('Quest T1'!H272=0, \" \",'Quest T1'!H272)","v":"Selfish"},null,null,{"$f":"IF('Quest T1'!I272=0, \" \",'Quest T1'!I272)","v":0.1},{"$f":"IF('Quest T2'!B257=0, \" \", 'Quest T2'!B257)","v":"Calm"},null,null,{"$f":"IF('Quest T2'!G257=0, \" \", 'Quest T2'!G257)","v":0.3},{"$f":"IF('Quest T2'!H257=0, \" \", 'Quest T2'!H257)","v":"Unfair"},null,null,{"$f":"IF('Quest T2'!I257=0, \" \", 'Quest T2'!I257)","v":0.05}]
[{"$f":"IF('Quest T1'!B273=0, \" \",'Quest T1'!B273)","v":"Altruistic"},null,null,{"$f":"IF('Quest T1'!G273=0, \" \",'Quest T1'!G273)","v":0.9},{"$f":"IF('Quest T1'!H273=0, \" \",'Quest T1'!H273)","v":"Disdainful"},null,null,{"$f":"IF('Quest T1'!I273=0, \" \",'Quest T1'!I273)","v":0.05},{"$f":"IF('Quest T2'!B258=0, \" \", 'Quest T2'!B258)","v":"Kind"},null,null,{"$f":"IF('Quest T2'!G258=0, \" \", 'Quest T2'!G258)","v":0.8},{"$f":"IF('Quest T2'!H258=0, \" \", 'Quest T2'!H258)","v":"Reckless"},null,null,{"$f":"IF('Quest T2'!I258=0, \" \", 'Quest T2'!I258)","v":0.15}]
[{"$f":"IF('Quest T1'!B274=0, \" \",'Quest T1'!B274)","v":"Well-organized"},null,null,{"$f":"IF('Quest T1'!G274=0, \" \",'Quest T1'!G274)","v":0.5},{"$f":"IF('Quest T1'!H274=0, \" \",'Quest T1'!H274)","v":"Full of hate"},null,null,{"$f":"IF('Quest T1'!I274=0, \" \",'Quest T1'!I274)","v":0.2},{"$f":"IF('Quest T2'!B259=0, \" \", 'Quest T2'!B259)","v":"Clever"},null,null,{"$f":"IF('Quest T2'!G259=0, \" \", 'Quest T2'!G259)","v":0.4},{"$f":"IF('Quest T2'!H259=0, \" \", 'Quest T2'!H259)","v":"Selfish"},null,null,{"$f":"IF('Quest T2'!I259=0, \" \", 'Quest T2'!I259)","v":0.1}]
[{"$f":"IF('Quest T1'!B275=0, \" \",'Quest T1'!B275)","v":" "},null,null,{"$f":"IF('Quest T1'!G275=0, \" \",'Quest T1'!G275)","v":" "},{"$f":"IF('Quest T1'!H275=0, \" \",'Quest T1'!H275)","v":" "},null,null,{"$f":"IF('Quest T1'!I275=0, \" \",'Quest T1'!I275)","v":" "},{"$f":"IF('Quest T2'!B260=0, \" \", 'Quest T2'!B260)","v":"Altruistic"},null,null,{"$f":"IF('Quest T2'!G260=0, \" \", 'Quest T2'!G260)","v":0.6},{"$f":"IF('Quest T2'!H260=0, \" \", 'Quest T2'!H260)","v":"Agressiv"},null,null,{"$f":"IF('Quest T2'!I260=0, \" \", 'Quest T2'!I260)","v":0.2}]
[{"$f":"IF('Quest T1'!B276=0, \" \",'Quest T1'!B276)","v":" "},null,null,{"$f":"IF('Quest T1'!G276=0, \" \",'Quest T1'!G276)","v":" "},{"$f":"IF('Quest T1'!H276=0, \" \",'Quest T1'!H276)","v":" "},null,null,{"$f":"IF('Quest T1'!I276=0, \" \",'Quest T1'!I276)","v":" "},{"$f":"IF('Quest T2'!B261=0, \" \", 'Quest T2'!B261)","v":"Efficient"},null,null,{"$f":"IF('Quest T2'!G261=0, \" \", 'Quest T2'!G261)","v":0.5},{"$f":"IF('Quest T2'!H261=0, \" \", 'Quest T2'!H261)","v":"Extreme"},null,null,{"$f":"IF('Quest T2'!I261=0, \" \", 'Quest T2'!I261)","v":0.7}]
[{"$f":"IF('Quest T1'!B277=0, \" \",'Quest T1'!B277)","v":" "},null,null,{"$f":"IF('Quest T1'!G277=0, \" \",'Quest T1'!G277)","v":" "},{"$f":"IF('Quest T1'!H277=0, \" \",'Quest T1'!H277)","v":" "},null,null,{"$f":"IF('Quest T1'!I277=0, \" \",'Quest T1'!I277)","v":" "},{"$f":"IF('Quest T2'!B262=0, \" \", 'Quest T2'!B262)","v":" "},null,null,{"$f":"IF('Quest T2'!G262=0, \" \", 'Quest T2'!G262)","v":" "},{"$f":"IF('Quest T2'!H262=0, \" \", 'Quest T2'!H262)","v":" "},null,null,{"$f":"IF('Quest T2'!I262=0, \" \", 'Quest T2'!I262)","v":" "}]
[{"$f":"IF('Quest T1'!B278=0, \" \",'Quest T1'!B278)","v":" "},null,null,{"$f":"IF('Quest T1'!G278=0, \" \",'Quest T1'!G278)","v":" "},{"$f":"IF('Quest T1'!H278=0, \" \",'Quest T1'!H278)","v":" "},null,null,{"$f":"IF('Quest T1'!I278=0, \" \",'Quest T1'!I278)","v":" "},{"$f":"IF('Quest T2'!B263=0, \" \", 'Quest T2'!B263)","v":" "},null,null,{"$f":"IF('Quest T2'!G263=0, \" \", 'Quest T2'!G263)","v":" "},{"$f":"IF('Quest T2'!H263=0, \" \", 'Quest T2'!H263)","v":" "},null,null,{"$f":"IF('Quest T2'!I263=0, \" \", 'Quest T2'!I263)","v":" "}]
[{"$f":"IF('Quest T1'!B279=0, \" \",'Quest T1'!B279)","v":" "},null,null,{"$f":"IF('Quest T1'!G279=0, \" \",'Quest T1'!G279)","v":" "},{"$f":"IF('Quest T1'!H279=0, \" \",'Quest T1'!H279)","v":" "},null,null,{"$f":"IF('Quest T1'!I279=0, \" \",'Quest T1'!I279)","v":" "},{"$f":"IF('Quest T2'!B264=0, \" \", 'Quest T2'!B264)","v":" "},null,null,{"$f":"IF('Quest T2'!G264=0, \" \", 'Quest T2'!G264)","v":" "},{"$f":"IF('Quest T2'!H264=0, \" \", 'Quest T2'!H264)","v":" "},null,null,{"$f":"IF('Quest T2'!I264=0, \" \", 'Quest T2'!I264)","v":" "}]
[]
[]
["How big is globally the discrepancy between this ideal and the way you perceive yourself?"]
[]
[]
[" "]
["How strong is the distress caused by this discrepancy?"]
[]
[]
[]
[null,null,"T1",null,"T2",null,null,null,null,null,"Confidence level"]
[null,"Dimensions","Score","Percentile","Score","Percentile","d","Sdiff","RCI","d/SD","Two-tailed","One-tailed"]
["Ideal Self","Discrepancy",{"$f":"'Quest T1'!$N$264","v":6},{"$f":"_xlfn.NORM.DIST(C39,C76,D76,TRUE)*100","v":95.74028408761437},{"$f":"'Quest T2'!N249","v":4},{"$f":"_xlfn.NORM.DIST(E39,C76,D76,TRUE)*100","v":59.134202008937905},{"$f":"E39-C39","v":-2},{"$f":"SQRT(2*(D76*SQRT(1-E76))^2)","v":0.74719397749178895},{"$f":"G39/H39","v":-2.6766811032306244},{"$f":"G39/D76","v":-1.4903129657228018},{"$f":"IF(ABS(I39)>0.84,(1-((1-_xlfn.NORM.S.DIST(ABS(I39),TRUE))*2)),\"no change\")","v":0.9925644631230035},{"$f":"IF(ABS(I39)>0.84,_xlfn.NORM.S.DIST(ABS(I39),TRUE),\"no change\")","v":0.99628223156150175}]
[null,"Distress",{"$f":"'Quest T1'!$N$267","v":4},{"$f":"_xlfn.NORM.DIST(C40,C77,D77,TRUE)*100","v":81.277774029813003},{"$f":"'Quest T2'!N252","v":3},{"$f":"_xlfn.NORM.DIST(E40,C77,D77,TRUE)*100","v":59.839745453013059},{"$f":"E40-C40","v":-1},{"$f":"SQRT(2*(D77*SQRT(1-E77))^2)","v":0.66397326753416797},{"$f":"G40/H40","v":-1.5060847309617629},{"$f":"G40/D77","v":-0.63897763578274758},{"$f":"IF(ABS(I40)>0.84,(1-((1-_xlfn.NORM.S.DIST(ABS(I40),TRUE))*2)),\"no change\")","v":0.86795457620549055},{"$f":"IF(ABS(I40)>0.84,_xlfn.NORM.S.DIST(ABS(I40),TRUE),\"no change\")","v":0.93397728810274527}]
["Ought self","Discrepancy",{"$f":"'Quest T1'!$N$285","v":5},{"$f":"_xlfn.NORM.DIST(C41,C78,D78,TRUE)*100","v":86.32780766381093},{"$f":"'Quest T2'!N270","v":5},{"$f":"_xlfn.NORM.DIST(E41,C78,D78,TRUE)*100","v":86.32780766381093},0,{"$f":"SQRT(2*(D78*SQRT(1-E78))^2)","v":0.98190467969146589},{"$f":"G41/H41","v":0},{"$f":"G41/D78","v":0},{"$f":"IF(ABS(I41)>0.84,(1-((1-_xlfn.NORM.S.DIST(ABS(I41),TRUE))*2)),\"no change\")","v":"no change"},{"$f":"IF(ABS(I41)>0.84,_xlfn.NORM.S.DIST(ABS(I41),TRUE),\"no change\")","v":"no change"}]
[null,"Distress",{"$f":"'Quest T1'!$N$288","v":5},{"$f":"_xlfn.NORM.DIST(C42,C79,D79,TRUE)*100","v":97.10388044163399},{"$f":"'Quest T2'!N273","v":4},{"$f":"_xlfn.NORM.DIST(E42,C79,D79,TRUE)*100","v":86.913063882148549},-1,{"$f":"SQRT(2*(D79*SQRT(1-E79))^2)","v":0.72857803425576884},{"$f":"G42/H42","v":-1.3725365753326402},{"$f":"G42/D79","v":-0.77399380804953555},{"$f":"IF(ABS(I42)>0.84,(1-((1-_xlfn.NORM.S.DIST(ABS(I42),TRUE))*2)),\"no change\")","v":0.83010353909004286},{"$f":"IF(ABS(I42)>0.84,_xlfn.NORM.S.DIST(ABS(I42),TRUE),\"no change\")","v":0.91505176954502143}]
[]
[]
[]
[]
[]
[]
[]
[]
[]
[]
[]
[]
[]
[]
[]
[]
[]
[]
[]
[]
[]
[]
[]
[]
[]
[]
[]
[]
[]
[]
[]
[]
["Normes (French)","Dimensions","M","SD","rxx"]
["Ideal Self","Discrepancy",3.69,1.3420000000000001,0.84499999999999997]
[null,"Distress",2.61,1.5649999999999999,0.91]
["Ought self","Discrepancy",3.55,1.3240000000000001,0.72499999999999998]
[null,"Distress",2.5499999999999998,1.292,0.84099999999999997]
[]
[]
[]
[]
[]
[]
[]
[]
[]
[]
[]
[]
[]
[]
[]
[]
[]
[]
[]
[]
[]
[]
[]
[]
[]
[]
[]
[]
[]
[]
[]
[]
[]
[]
[]
[]
[]
[]
[]
[]
[]
[]
[]
[]
[]
[]
[]
[]
[]
[]
[]
[]
[]
[]
[]
[]
[]
[]
[]
[]
[]
[]
[]
[]
[]
[]
[]
[]
[]
[]
[]
[]
[]
[]
[]
[]
[]
[]
[]
[]
[]
[]
[]
[]
[]
[]
[]
[]
[]
[]
[]
[]
[]
[]
[]
[]
[]
[]
[]
[]
[]
[]
[]
[]
[]
[]
[]
[]
[]
[]
[]
[]
[]
[]
[]
[]
[]
[]
[]
[]
[]
[]
[]
[]
[]
[]
[]
[]
[]
[]
[]
[]
[]
[]
[]
[]
[]
[]
[]
[]
[]
[]
[]
[]
[]
[]
[]
[]
[]
[]
[]
[]
[]
[]
[]
[]
[]
[]
[]
[]
[]
[]
[]
[]
[]
[]
[]
[]
[]
[]
[]
[]
[]
[]
[]
[]
[]
[]
[]
[]
[]
[]
[]
[]
[]
[]
[]
[]
[]
[]
[]
[]
[]
[]
[]
[]
[null,null,null,null,"Dimension 1",null,null,null,null,null,"Dimension 2",null,null,null,null,null,"Dimension3",null,null,null,null,null,"Dimension4"]
[]
[null,null,null,null,"T1",{"$f":"C39","v":6},null,null,null,null,"T1",{"$f":"C40","v":4},null,null,null,null,"T1",{"$f":"C41","v":5},null,null,null,null,"T1",{"$f":"C42","v":5}]
[null,null,null,null,"T2",{"$f":"E39","v":4},null,null,null,null,"T2",{"$f":"E40","v":3},null,null,null,null,"T2",{"$f":"E41","v":5},null,null,null,null,"T2",{"$f":"E42","v":4}]
[null,null,null,null,"norme M",{"$f":"C76","v":3.69},null,null,null,null,"norme M",{"$f":"C77","v":2.61},null,null,null,null,"norme M",{"$f":"C78","v":3.55},null,null,null,null,"norme M",{"$f":"C79","v":2.5499999999999998}]
[null,null,null,null,"norme SD",{"$f":"D76","v":1.3420000000000001},null,null,null,null,"norme SD",{"$f":"D77","v":1.5649999999999999},null,null,null,null,"norme SD",{"$f":"D78","v":1.3240000000000001},null,null,null,null,"norme SD",{"$f":"D79","v":1.292}]
[null,null,null,null,null,null,"x","densité",null,null,null,null,"x","densité",null,null,null,null,"x","densité",null,null,null,null,"x","densité"]
[null,null,null,null,-30,{"$f":"E283*F$281/10","v":-4.0260000000000007},{"$f":"F283+F$280","v":-0.33600000000000074},{"$f":"NORMDIST(G283,F$280,F$281,FALSE)","v":3.3024205752146046E-3},1,null,-30,{"$f":"K283*L$281/10","v":-4.6949999999999994},{"$f":"L283+L$280","v":-2.0849999999999995},{"$f":"NORMDIST(M283,L$280,L$281,FALSE)","v":2.8318520204076779E-3},1,null,-30,{"$f":"Q283*R$281/10","v":-3.972},{"$f":"R283+R$280","v":-0.42200000000000015},{"$f":"NORMDIST(S283,R$280,R$281,FALSE)","v":3.3473175316752319E-3},1,null,-30,{"$f":"W283*X$281/10","v":-3.8759999999999999},{"$f":"X283+X$280","v":-1.3260000000000001},{"$f":"NORMDIST(Y283,X$280,X$281,FALSE)","v":3.4302232290541849E-3},1]
[null,null,null,null,{"$f":"E283+0.5","v":-29.5},{"$f":"E284*F$281/10","v":-3.9589000000000008},{"$f":"F284+F$280","v":-0.26890000000000081},3.8320722228419816E-3,2,null,{"$f":"K283+0.5","v":-29.5},{"$f":"K284*L$281/10","v":-4.6167499999999997},{"$f":"L284+L$280","v":-2.0067499999999998},3.2860325386926156E-3,2,null,{"$f":"Q283+0.5","v":-29.5},{"$f":"Q284*R$281/10","v":-3.9058000000000002},{"$f":"R284+R$280","v":-0.35580000000000034},3.884169881460679E-3,2,null,{"$f":"W283+0.5","v":-29.5},{"$f":"W284*X$281/10","v":-3.8114000000000003},{"$f":"X284+X$280","v":-1.2614000000000005},3.980372231465897E-3,2]
[null,null,null,null,{"$f":"E284+0.5","v":-29},-3.8917999999999999,-0.20179999999999998,4.4355681220386387E-3,3,null,{"$f":"K284+0.5","v":-29},-4.5385,-1.9285000000000001,3.8035350925085328E-3,3,null,{"$f":"Q284+0.5","v":-29},-3.8395999999999999,-0.28960000000000008,4.4958704076856898E-3,3,null,{"$f":"W284+0.5","v":-29},-3.7468000000000004,-1.1968000000000005,4.6072232351206249E-3,3]
[null,null,null,null,-28.5,-3.8247,-0.13470000000000004,5.1212866547049015E-3,4,null,-28.5,-4.4602500000000003,-1.8502500000000004,4.3915442112549335E-3,4,null,-28.5,-3.7734000000000001,-0.22340000000000027,5.1909113977446908E-3,4,null,-28.5,-3.6822000000000004,-1.1322000000000005,5.3194788627043115E-3,4]
[null,null,null,null,-28,-3.7576000000000001,-6.7600000000000104E-2,5.8982500618330611E-3,5,null,-28,-4.3819999999999997,-1.7719999999999998,5.0577965386453469E-3,5,null,-28,-3.7072000000000003,-0.15720000000000045,5.9784377514954358E-3,5,null,-28,-3.6176000000000004,-1.0676000000000005,6.1265105131423818E-3,5]
[null,null,null,null,-27.5,-3.6905000000000001,-5.0000000000016698E-4,6.7761270503659109E-3,6,null,-27.5,-4.30375,-1.6937500000000001,5.8105830681092988E-3,6,null,-27.5,-3.6410000000000005,-9.1000000000000636E-2,6.8682496235581963E-3,6,null,-27.5,-3.5529999999999999,-1.0030000000000001,7.0383610693429194E-3,6]
[null,null,null,null,-27,-3.6234000000000002,6.659999999999977E-2,7.765227134443063E-3,7,null,-27,-4.2254999999999994,-1.6154999999999995,6.6587442903658818E-3,7,null,-27,-3.5748000000000006,-2.4800000000000821E-2,7.8707966876303548E-3,7,null,-27,-3.4883999999999999,-0.93840000000000012,8.0657390204509332E-3,7]
[null,null,null,null,-26.5,-3.5563000000000002,0.13369999999999971,8.8764855496312814E-3,8,null,-26.5,-4.1472499999999997,-1.5372499999999998,7.6116572572557054E-3,8,null,-26.5,-3.5085999999999999,4.1399999999999881E-2,8.9971628456232463E-3,8,null,-26.5,-3.4238,-0.87380000000000013,9.22000279226407E-3,8]
[null,null,null,null,-26,-3.4892000000000003,0.20079999999999965,1.0121437580987788E-2,9,null,-26,-4.069,-1.4590000000000001,8.6792135678502337E-3,9,null,-26,-3.4424000000000001,0.1075999999999997,1.0259040206711187E-2,9,null,-26,-3.3592,-0.80920000000000014,1.051313408180001E-2,9]
[null,null,null,null,-25.5,-3.4221000000000004,0.26789999999999958,1.1512181173170761E-2,10,null,-25.5,-3.9907499999999998,-1.3807499999999999,9.8717873063227952E-3,10,null,-25.5,-3.3761999999999999,0.17379999999999995,1.1668691189120221E-2,10,null,-25.5,-3.2946,-0.74460000000000015,1.19576990204297E-2,10]
[null,null,null,null,-25,-3.3550000000000004,0.33499999999999952,1.3061326746325291E-2,11,null,-25,-3.9125000000000001,-1.3025000000000002,1.1200192008669995E-2,11,null,-25,-3.31,0.23999999999999977,1.3238897653752675E-2,11,null,-25,-3.2300000000000004,-0.6800000000000006,1.3566796047653654E-2,11]
[null,null,null,null,-24.5,-3.2879000000000005,0.40209999999999946,1.4781933227865359E-2,12,null,-24.5,-3.8342499999999999,-1.2242500000000001,1.2675625809453875E-2,12,null,-24.5,-3.2438000000000002,0.30619999999999958,1.4982896066310657E-2,12,null,-24.5,-3.1654,-0.61540000000000017,1.5353989467333851E-2,12]
[null,null,null,null,-24,-3.2207999999999997,0.46920000000000028,1.6687429429838248E-2,13,null,-24,-3.7560000000000002,-1.1460000000000004,1.4309604022263823E-2,13,null,-24,-3.1776000000000004,0.3723999999999994,1.6914297805772565E-2,13,null,-24,-3.1008000000000004,-0.55080000000000062,1.7333227782386128E-2,13]
[null,null,null,null,-23.5,-3.1537000000000002,0.53629999999999978,1.8791520056031581E-2,14,null,-23.5,-3.6777499999999996,-1.0677499999999998,1.6113878540060331E-2,14,null,-23.5,-3.1114000000000002,0.43859999999999966,1.9046993893651346E-2,14,null,-23.5,-3.0362,-0.48620000000000019,1.9518746064391936E-2,14]
[null,null,null,null,-23,-3.0866000000000002,0.60339999999999971,2.1108075813413701E-2,15,null,-23,-3.5994999999999999,-0.98950000000000005,1.8100343604856989E-2,15,null,-23,-3.0452000000000004,0.50479999999999947,2.139504361148124E-2,15,null,-23,-2.9716,-0.4216000000000002,2.1924951812384817E-2,15]
[null,null,null,null,-22.5,-3.0194999999999999,0.6705000000000001,2.3651007329111361E-2,16,null,-22.5,-3.5212499999999998,-0.91124999999999989,2.0280927690522314E-2,16,null,-22.5,-2.9790000000000001,0.57099999999999973,2.3972546703676299E-2,16,null,-22.5,-2.907,-0.35700000000000021,2.4566293990454659E-2,16]
[null,null,null,null,-22,-2.9523999999999999,0.73760000000000003,2.6434122836238041E-2,17,null,-22,-3.4430000000000001,-0.83300000000000018,2.2667471467240526E-2,17,null,-22,-2.9127999999999998,0.63719999999999999,2.6793499128573608E-2,17,null,-22,-2.8424,-0.29240000000000022,2.7457115206061471E-2,17]
[null,null,null,null,-21.5,-2.8853,0.80469999999999997,2.9470969887757242E-2,18,null,-21.5,-3.3647499999999999,-0.75475000000000003,2.5271592069885124E-2,18,null,-21.5,-2.8466,0.7033999999999998,2.9871632620370254E-2,18,null,-21.5,-2.7778,-0.22780000000000022,3.0611487298274162E-2,18]
[null,null,null,null,-21,-2.8182,0.87179999999999991,3.2774661684371972E-2,19,null,-21,-3.2865000000000002,-0.67650000000000032,2.810453417279693E-2,19,null,-21,-2.7804000000000002,0.76959999999999962,3.3220238655911775E-2,19,null,-21,-2.7132000000000001,-0.16320000000000023,3.4043030944603092E-2,19]
[null,null,null,null,-20.5,-2.7511000000000001,0.93889999999999985,3.6357688956171953E-2,20,null,-20.5,-3.2082499999999996,-0.59824999999999973,3.1177008676794103E-2,20,null,-20.5,-2.7142000000000004,0.83579999999999943,3.6851977778838918E-2,20,null,-20.5,-2.6486000000000001,-9.8600000000000243E-2,3.7764720262525357E-2,20]
[null,null,null,null,-20,-2.6840000000000002,1.0059999999999998,4.0231718713254885E-2,21,null,-20,-3.13,-0.52,3.44990201362224E-2,21,null,-20,-2.6480000000000001,0.90199999999999969,4.0778675614190373E-2,21,null,-20,-2.5840000000000001,-3.4000000000000252E-2,4.1788673771817379E-2,21]
[null,null,null,null,-19.5,-2.6169000000000002,1.0730999999999997,4.4407381571397966E-2,22,null,-19.5,-3.0517499999999997,-0.44174999999999986,3.8079684389019861E-2,22,null,-19.5,-2.5818000000000003,0.96819999999999951,4.5011107302731154E-2,22,null,-19.5,-2.5194000000000001,3.0599999999999739E-2,4.6125933489795726E-2,22]
[null,null,null,null,-19,-2.5498000000000003,1.1401999999999997,4.8894049757583144E-2,23,null,-19,-2.9735,-0.36350000000000016,4.1927038194681528E-2,23,null,-19,-2.5156000000000001,1.0343999999999998,4.9558772488426425E-2,23,null,-19,-2.4548000000000001,9.5199999999999729E-2,5.078623434572492E-2,23]
[null,null,null,null,-18.5,-2.4827000000000004,1.2072999999999996,5.3699608298225024E-2,24,null,-18.5,-2.8952499999999999,-0.28525,4.6047843026337375E-2,24,null,-18.5,-2.4493999999999998,1.1006,5.4429663395935059E-2,24,null,-18.5,-2.3902000000000001,0.15979999999999972,5.5777766514100616E-2,24]
[null,null,null,null,-18,-2.4156000000000004,1.2743999999999995,5.8830222280845085E-2,25,null,-18,-2.8169999999999997,-0.20699999999999985,5.0447385495779033E-2,25,null,-18,-2.3832,1.1667999999999998,5.9630028928167808E-2,25,null,-18,-2.3256000000000001,0.22439999999999971,6.1106933669422707E-2,25]
[null,null,null,null,-17.5,-2.3485000000000005,1.3414999999999995,6.4290103447475017E-2,26,null,-17.5,-2.73875,-0.12875000000000014,5.5129277205438677E-2,26,null,-17.5,-2.3170000000000002,1.2329999999999997,6.5164138086489062E-2,26,null,-17.5,-2.2610000000000001,0.2889999999999997,6.6778110546835537E-2,26]
[null,null,null,null,-17,-2.2814000000000001,1.4085999999999999,7.0081279714520814E-2,27,null,-17,-2.6604999999999999,-5.0499999999999989E-2,6.009525710983192E-2,27,null,-17,-2.2508000000000004,1.2991999999999995,7.1034046357165329E-2,27,null,-17,-2.1964000000000001,0.35359999999999969,7.2793403542482163E-2,27]
[null,null,null,null,-16.5,-2.2143000000000002,1.4756999999999998,7.6203371508180351E-2,28,null,-16.5,-2.5822499999999997,2.7750000000000163E-2,6.5344999721391725E-2,28,null,-16.5,-2.1846000000000001,1.3653999999999997,7.7239369006025696E-2,28,null,-16.5,-2.1318000000000001,0.41819999999999968,7.9152418393171817E-2,28]
[null,null,null,null,-16,-2.1472000000000002,1.5427999999999997,8.2653379045793993E-2,29,null,-16,-2.504,0.10599999999999987,7.0875932702527511E-2,29,null,-16,-2.1184000000000003,1.4315999999999995,8.3777065467866729E-2,29,null,-16,-2.0672000000000001,0.48279999999999967,8.5852039225584778E-2,29]
[null,null,null,null,-15.5,-2.0801000000000003,1.6098999999999997,8.9425484871077182E-2,30,null,-15.5,-2.4257499999999999,0.18425000000000002,7.6683067538009964E-2,30,null,-15.5,-2.0522,1.4977999999999998,9.0641239197119014E-2,30,null,-15.5,-2.0026000000000002,0.54739999999999966,9.2886223449679242E-2,30]
[null,null,null,null,-15,-2.0130000000000003,1.6769999999999996,9.6510876055060854E-2,31,null,-15,-2.3474999999999997,0.26250000000000018,8.2758847070857372E-2,31,null,-15,-1.986,1.5639999999999998,9.7822957451579859E-2,31,null,-15,-1.9379999999999999,0.61199999999999988,0.10024581707886358,31]
[null,null,null,null,-14.5,-1.9459,1.7441,0.10389759049579751,32,null,-14.5,-2.26925,0.34074999999999989,8.9093013703105614E-2,32,null,-14.5,-1.9198,1.6301999999999999,0.10531009550253798,32,null,-14.5,-1.8734000000000002,0.67659999999999965,0.10791839508154817,32]
[null,null,null,null,-14,-1.8788,1.8111999999999999,0.11157039168088291,33,null,-14,-2.1909999999999998,0.41900000000000004,9.5672502003670848E-2,33,null,-14,-1.8536000000000001,1.6963999999999997,0.11308720969467131,33,null,-14,-1.8088000000000002,0.74119999999999964,0.11588813129701611,33]
[null,null,null,null,-13.5,-1.8117000000000001,1.8782999999999999,0.11951067611171354,34,null,-13.5,-2.1127499999999997,0.49725000000000019,0.10248135932391032,34,null,-13.5,-1.7874000000000003,1.7625999999999995,0.12113544361172175,34,null,-13.5,-1.7442,0.80579999999999985,0.12413570227702757,34]
[null,null,null,null,-13,-1.7446000000000002,1.9453999999999998,0.12769641732325435,35,null,-13,-2.0345,0.5754999999999999,0.10950069779412609,35,null,-13,-1.7212000000000001,1.8287999999999998,0.12943247133520192,35,null,-13,-1.6796,0.87039999999999984,0.13263822913916976,35]
[null,null,null,null,-12.5,-1.6775000000000002,2.0124999999999997,0.13610215006633525,36,null,-12.5,-1.95625,0.65374999999999983,0.11670868075975843,36,null,-12.5,-1.655,1.8949999999999998,0.13795248141164798,36,null,-12.5,-1.6150000000000002,0.93499999999999961,0.14136926113701384,36]
[null,null,null,null,-12,-1.6103999999999998,2.0796000000000001,0.14469899775202164,37,null,-12,-1.8780000000000001,0.73199999999999976,0.12408054631515204,37,null,-12,-1.5888000000000002,1.9611999999999996,0.14666620467010039,37,null,-12,-1.5504000000000002,0.9995999999999996,0.15029880416657346,37]
[null,null,null,null,-11.5,-1.5433000000000001,2.1467000000000001,0.15345474569297674,38,null,-11.5,-1.79975,0.81024999999999991,0.13158867010861008,38,null,-11.5,-1.5226000000000002,2.0273999999999996,0.15554098845919542,38,null,-11.5,-1.4858,1.0641999999999998,0.15939339684208573,38]
[null,null,null,null,-11,-1.4762,2.2138,0.16233396202127465,39,null,-11,-1.7215,0.88849999999999985,0.13920266903038372,39,null,-11,-1.4563999999999999,2.0935999999999999,0.16454091920887504,39,null,-11,-1.4212,1.1287999999999998,0.16861623609330537,39]
[null,null,null,null,-10.5,-1.4091,2.2808999999999999,0.17129816742491283,40,null,-10.5,-1.6432500000000001,0.96674999999999978,0.14688954676308819,40,null,-10.5,-1.3902000000000001,2.1597999999999997,0.17362699447449623,40,null,-10.5,-1.3566,1.1933999999999998,0.17792735347076857,40]
[null,null,null,null,-10,-1.3420000000000001,2.3479999999999999,0.18030605403810979,41,null,-10,-1.5649999999999999,1.0449999999999999,0.15461388148188077,41,null,-10,-1.3240000000000001,2.226,0.18275734480297839,41,null,-10,-1.292,1.2579999999999998,0.18728384250707689,41]
[null,null,null,null,-9.5,-1.2749000000000001,2.4150999999999998,0.18931375295766689,42,null,-9.5,-1.48675,1.1232499999999999,0.16233805525187797,42,null,-9.5,-1.2578,2.2921999999999998,0.19188750488609443,42,null,-9.5,-1.2274,1.3225999999999998,0.19664013658605961,42]
[null,null,null,null,-9,-1.2078000000000002,2.4821999999999997,0.19827514895585302,43,null,-9,-1.4084999999999999,1.2015,0.17002252389696798,43,null,-9,-1.1916,2.3583999999999996,0.20097073255192957,43,null,-9,-1.1628000000000001,1.3871999999999998,0.20594833583494956,43]
[null,null,null,null,-8.5,-1.1407,2.5492999999999997,0.20714224003800033,44,null,-8.5,-1.3302499999999999,1.2797499999999999,0.17762612532332042,44,null,-8.5,-1.1254000000000002,2.4245999999999999,0.20995837321072242,44,null,-8.5,-1.0982000000000001,1.4517999999999998,0.2151585805967465,44]
[null,null,null,null,-8,-1.0736000000000001,2.6163999999999996,0.21586553857040439,45,null,-8,-1.252,1.3579999999999999,0.18510642348976533,45,null,-8,-1.0592000000000001,2.4907999999999997,0.21880026643616518,45,null,-8,-1.0336000000000001,1.5163999999999997,0.22421946808164298,45]
[null,null,null,null,-7.5,-1.0065000000000002,2.6834999999999996,0.22439450980238773,46,null,-7.5,-1.1737499999999998,1.43625,0.19242008444396452,46,null,-7.5,-0.99299999999999999,2.5569999999999999,0.22744519044924807,46,null,-7.5,-0.96899999999999997,1.581,0.23307850785975578,46]
[null,null,null,null,-7,-0.93940000000000001,2.7505999999999999,0.23267804274721407,47,null,-7,-1.0954999999999999,1.5145,0.19952328010655673,47,null,-7,-0.92680000000000007,2.6231999999999998,0.23584133940087706,47,null,-7,-0.90440000000000009,1.6455999999999997,0.2416826109649855,47]
[null,null,null,null,-6.5,-0.87230000000000008,2.8176999999999999,0.24066494759159038,48,null,-6.5,-1.01725,1.5927499999999999,0.20637211480377909,48,null,-6.5,-0.86060000000000003,2.6894,0.24393682754374194,48,null,-6.5,-0.83979999999999999,1.7101999999999999,0.24997860655411328,48]
[null,null,null,null,-6,-0.80519999999999992,2.8848000000000003,0.24830447309374046,49,null,-6,-0.93900000000000006,1.6709999999999998,0.21292306894044707,49,null,-6,-0.79440000000000011,2.7555999999999998,0.25168021366450127,49,null,-6,-0.77520000000000011,1.7747999999999997,0.25791377932801829,49]
[null,null,null,null,-5.5,-0.73809999999999998,2.9519000000000002,0.25554683682517426,50,null,-5.5,-0.86075000000000002,1.74925,0.21913345368650733,50,null,-5.5,-0.72819999999999996,2.8217999999999996,0.25902103853427788,50,null,-5.5,-0.71060000000000001,1.8393999999999999,0.26543642029364078,50]
[null,null,null,null,-5,-0.67100000000000004,3.0190000000000001,0.26234376062913523,51,null,-5,-0.78249999999999997,1.8274999999999999,0.22496187013693264,51,null,-5,-0.66200000000000003,2.8879999999999999,0.26591036764675186,51,null,-5,-0.64600000000000002,1.9039999999999999,0.27249638294450423,51]
[null,null,null,null,-4.5,-0.6039000000000001,3.0861000000000001,0.26864900332462588,52,null,-4.5,-0.70424999999999993,1.9057499999999998,0.23036866610967921,52,null,-4.5,-0.5958,2.9541999999999997,0.27230133116438665,52,null,-4.5,-0.58140000000000003,1.9685999999999999,0.27904563658022291,52]
[null,null,null,null,-4,-0.53680000000000005,3.1532,0.27441888249129909,53,null,-4,-0.626,1.984,0.2353163835803983,53,null,-4,-0.52960000000000007,3.0203999999999995,0.27814965279707199,53,null,-4,-0.51680000000000004,2.0331999999999999,0.285038808284306,53]
[null,null,null,null,-3.5,-0.46970000000000001,3.2202999999999999,0.27961277713631738,54,null,-3.5,-0.54774999999999996,2.0622499999999997,0.23977018972328298,54,null,-3.5,-0.46340000000000003,3.0865999999999998,0.28341415930282321,54,null,-3.5,-0.45220000000000005,2.0977999999999999,0.29043370504406957,54]
[null,null,null,null,-3,-0.40259999999999996,3.2873999999999999,0.28419360317475711,55,null,-3,-0.46950000000000003,2.1404999999999998,0.24369828463931251,55,null,-3,-0.39720000000000005,3.1527999999999996,0.28805726243241997,55,null,-3,-0.38760000000000006,2.1623999999999999,0.2951918076319846,55]
[null,null,null,null,-2.5,-0.33550000000000002,3.3544999999999998,0.28812825395145247,56,null,-2.5,-0.39124999999999999,2.21875,0.24707227910725191,56,null,-2.5,-0.33100000000000002,3.2189999999999999,0.29204540544021845,56,null,-2.5,-0.32300000000000001,2.2269999999999999,0.29927872817557988,56]
[null,null,null,null,-2,-0.26840000000000003,3.4215999999999998,0.29138799849139779,57,null,-2,-0.313,2.2969999999999997,0.24986753608655327,57,null,-2,-0.26480000000000004,3.2851999999999997,0.29534946674883372,57,null,-2,-0.25840000000000002,2.2915999999999999,0.3026646238200123,57]
[null,null,null,null,-1.5,-0.20129999999999998,3.4887000000000001,0.29394883078084122,58,null,-1.5,-0.23475000000000001,2.3752499999999999,0.25206347022868303,58,null,-1.5,-0.19860000000000003,3.3513999999999999,0.29794511397876805,58,null,-1.5,-0.19380000000000003,2.3561999999999999,0.30532455952622983,58]
[null,null,null,null,-1,-0.13420000000000001,3.5558000000000001,0.29579176414084335,59,null,-1,-0.1565,2.4535,0.25364380030479988,59,null,-1,-0.13240000000000002,3.4175999999999997,0.29981310232402703,59,null,-1,-0.12920000000000001,2.4207999999999998,0.30723881383669643,59]
[null,null,null,null,-0.5,-6.7100000000000007E-2,3.6229,0.29690306564438451,60,null,-0.5,-7.825E-2,2.5317499999999997,0.25459675022029649,60,null,-0.5,-6.6200000000000009E-2,3.4838,0.30093951215616616,60,null,-0.5,-6.4600000000000005E-2,2.4853999999999998,0.30839312236436844,60]
[null,null,null,null,0,0,3.69,0.29727442652863839,61,null,0,0,2.61,0.25491519514468541,61,null,0,0,3.55,0.30131592175334793,61,null,0,0,2.5499999999999998,0.30877885479987049,61]
[null,null,null,null,0.5,6.7100000000000007E-2,3.7570999999999999,0.29690306564438451,62,null,0.5,7.825E-2,2.68825,0.25459675022029649,62,null,0.5,6.6200000000000009E-2,3.6161999999999996,0.30093951215616616,62,null,0.5,6.4600000000000005E-2,2.6145999999999998,0.30839312236436844,62]
[null,null,null,null,1,0.13420000000000001,3.8241999999999998,0.29579176414084335,63,null,1,0.1565,2.7664999999999997,0.25364380030479988,63,null,1,0.13240000000000002,3.6823999999999999,0.29981310232402703,63,null,1,0.12920000000000001,2.6791999999999998,0.30723881383669643,63]
[null,null,null,null,1.5,0.20129999999999998,3.8912999999999998,0.29394883078084122,64,null,1.5,0.23475000000000001,2.8447499999999999,0.25206347022868303,64,null,1.5,0.19860000000000003,3.7485999999999997,0.29794511397876805,64,null,1.5,0.19380000000000003,2.7437999999999998,0.30532455952622983,64]
[null,null,null,null,2,0.26840000000000003,3.9584000000000001,{"$f":"NORMDIST(G347,F$280,F$281,FALSE)","v":0.29138799849139779},65,null,2,0.313,2.923,{"$f":"NORMDIST(M347,L$280,L$281,FALSE)","v":0.24986753608655327},65,null,2,0.26480000000000004,3.8148,{"$f":"NORMDIST(S347,R$280,R$281,FALSE)","v":0.29534946674883372},65,null,2,0.25840000000000002,2.8083999999999998,{"$f":"NORMDIST(Y347,X$280,X$281,FALSE)","v":0.3026646238200123},65]
[null,null,null,null,2.5,{"$f":"E348*F$281/10","v":0.33550000000000002},{"$f":"F348+F$280","v":4.0255000000000001},0.28812825395145247,66,null,2.5,{"$f":"K348*L$281/10","v":0.39124999999999999},{"$f":"L348+L$280","v":3.0012499999999998},0.24707227910725191,66,null,2.5,{"$f":"Q348*R$281/10","v":0.33100000000000002},{"$f":"R348+R$280","v":3.8809999999999998},0.29204540544021845,66,null,2.5,{"$f":"W348*X$281/10","v":0.32300000000000001},{"$f":"X348+X$280","v":2.8729999999999998},0.29927872817557988,66]
[null,null,null,null,{"$f":"E348+0.5","v":3},0.40259999999999996,4.0926,0.28419360317475711,67,null,{"$f":"K348+0.5","v":3},0.46950000000000003,3.0794999999999999,0.24369828463931251,67,null,{"$f":"Q348+0.5","v":3},0.39720000000000005,3.9472,0.28805726243241997,67,null,{"$f":"W348+0.5","v":3},0.38760000000000006,2.9375999999999998,0.2951918076319846,67]
[null,null,null,null,{"$f":"E349+0.5","v":3.5},0.46970000000000001,4.1597,0.27961277713631738,68,null,{"$f":"K349+0.5","v":3.5},0.54774999999999996,3.1577500000000001,0.23977018972328298,68,null,{"$f":"Q349+0.5","v":3.5},0.46340000000000003,4.0133999999999999,0.28341415930282321,68,null,{"$f":"W349+0.5","v":3.5},0.45220000000000005,3.0021999999999998,0.29043370504406957,68]
[null,null,null,null,{"$f":"E350+0.5","v":4},0.53680000000000005,4.2267999999999999,0.27441888249129909,69,null,{"$f":"K350+0.5","v":4},0.626,3.2359999999999998,0.2353163835803983,69,null,{"$f":"Q350+0.5","v":4},0.52960000000000007,4.0796000000000001,0.27814965279707199,69,null,{"$f":"W350+0.5","v":4},0.51680000000000004,3.0667999999999997,0.285038808284306,69]
[null,null,null,null,{"$f":"E351+0.5","v":4.5},0.6039000000000001,4.2938999999999998,0.26864900332462588,70,null,{"$f":"K351+0.5","v":4.5},0.70424999999999993,3.3142499999999999,0.23036866610967921,70,null,{"$f":"Q351+0.5","v":4.5},0.5958,4.1457999999999995,0.27230133116438671,70,null,{"$f":"W351+0.5","v":4.5},0.58140000000000003,3.1313999999999997,0.27904563658022291,70]
[null,null,null,null,5,0.67100000000000004,4.3609999999999998,0.26234376062913523,71,null,5,0.78249999999999997,3.3925000000000001,0.22496187013693258,71,null,5,0.66200000000000003,4.2119999999999997,0.26591036764675186,71,null,5,0.64600000000000002,3.1959999999999997,0.27249638294450423,71]
[null,null,null,null,5.5,0.73809999999999998,4.4280999999999997,0.25554683682517426,72,null,5.5,0.86075000000000002,3.4707499999999998,0.21913345368650733,72,null,5.5,0.72819999999999996,4.2782,0.25902103853427788,72,null,5.5,0.71060000000000001,3.2605999999999997,0.26543642029364078,72]
[null,null,null,null,6,0.80519999999999992,4.4951999999999996,0.24830447309374046,73,null,6,0.93900000000000006,3.5489999999999999,0.21292306894044707,73,null,6,0.79440000000000011,4.3444000000000003,0.25168021366450122,73,null,6,0.77520000000000011,3.3251999999999997,0.25791377932801829,73]
[null,null,null,null,6.5,0.87230000000000008,4.5623000000000005,0.24066494759159029,74,null,6.5,1.01725,3.6272500000000001,0.20637211480377909,74,null,6.5,0.86060000000000003,4.4105999999999996,0.24393682754374194,74,null,6.5,0.83979999999999999,3.3897999999999997,0.24997860655411328,74]
[null,null,null,null,7,0.93940000000000001,4.6294000000000004,0.23267804274721401,75,null,7,1.0954999999999999,3.7054999999999998,0.19952328010655673,75,null,7,0.92680000000000007,4.4767999999999999,0.23584133940087706,75,null,7,0.90440000000000009,3.4543999999999997,0.24168261096498553,75]
[null,null,null,null,7.5,1.0065000000000002,4.6965000000000003,0.22439450980238773,76,null,7.5,1.1737499999999998,3.7837499999999995,0.19242008444396452,76,null,7.5,0.99299999999999999,4.5430000000000001,0.22744519044924802,76,null,7.5,0.96899999999999997,3.5189999999999997,0.23307850785975578,76]
[null,null,null,null,8,1.0736000000000001,4.7636000000000003,0.21586553857040439,77,null,8,1.252,3.8620000000000001,0.18510642348976533,77,null,8,1.0592000000000001,4.6091999999999995,0.21880026643616524,77,null,8,1.0336000000000001,3.5835999999999997,0.22421946808164303,77]
[null,null,null,null,8.5,1.1407,4.8307000000000002,0.20714224003800033,78,null,8.5,1.3302499999999999,3.9402499999999998,0.17762612532332042,78,null,8.5,1.1254000000000002,4.6753999999999998,0.20995837321072242,78,null,8.5,1.0982000000000001,3.6482000000000001,0.21515858059674647,78]
[null,null,null,null,9,1.2078000000000002,4.8978000000000002,0.19827514895585302,79,null,9,1.4084999999999999,4.0184999999999995,0.17002252389696798,79,null,9,1.1916,4.7416,0.20097073255192957,79,null,9,1.1628000000000001,3.7127999999999997,0.20594833583494959,79]
[null,null,null,null,9.5,1.2749000000000001,4.9649000000000001,0.18931375295766689,80,null,9.5,1.48675,4.0967500000000001,0.16233805525187797,80,null,9.5,1.2578,4.8078000000000003,0.19188750488609438,80,null,9.5,1.2274,3.7774000000000001,0.19664013658605958,80]
[null,null,null,null,10,1.3420000000000001,5.032,0.18030605403810979,81,null,10,1.5649999999999999,4.1749999999999998,0.15461388148188077,81,null,10,1.3240000000000001,4.8739999999999997,0.18275734480297839,81,null,10,1.292,3.8419999999999996,0.18728384250707694,81]
[null,null,null,null,10.5,1.4091,5.0991,0.17129816742491283,82,null,10.5,1.6432500000000001,4.2532499999999995,0.14688954676308824,82,null,10.5,1.3902000000000001,4.9401999999999999,0.17362699447449623,82,null,10.5,1.3566,3.9066000000000001,0.17792735347076855,82]
[null,null,null,null,11,1.4762,5.1661999999999999,0.16233396202127465,83,null,11,1.7215,4.3315000000000001,0.13920266903038372,83,null,11,1.4563999999999999,5.0063999999999993,0.16454091920887509,83,null,11,1.4212,3.9711999999999996,0.16861623609330542,83]
[null,null,null,null,11.5,1.5433000000000001,5.2332999999999998,0.15345474569297674,84,null,11.5,1.79975,4.4097499999999998,0.13158867010861008,84,null,11.5,1.5226000000000002,5.0725999999999996,0.15554098845919548,84,null,11.5,1.4858,4.0358000000000001,0.1593933968420857,84]
[null,null,null,null,{"$f":"E366+0.5","v":12},1.6103999999999998,5.3003999999999998,0.14469899775202164,85,null,{"$f":"K366+0.5","v":12},1.8780000000000001,4.4879999999999995,0.1240805463151521,85,null,{"$f":"Q366+0.5","v":12},1.5888000000000002,5.1387999999999998,0.14666620467010041,85,null,{"$f":"W366+0.5","v":12},1.5504000000000002,4.1004000000000005,0.1502988041665734,85]
[null,null,null,null,{"$f":"E367+0.5","v":12.5},1.6775000000000002,5.3674999999999997,0.13610215006633528,86,null,{"$f":"K367+0.5","v":12.5},1.95625,4.5662500000000001,0.11670868075975839,86,null,{"$f":"Q367+0.5","v":12.5},1.655,5.2050000000000001,0.13795248141164793,86,null,{"$f":"W367+0.5","v":12.5},1.6150000000000002,4.165,0.14136926113701384,86]
[null,null,null,null,13,1.7446000000000002,5.4345999999999997,0.12769641732325443,87,null,13,2.0345,4.6444999999999999,0.10950069779412609,87,null,13,1.7212000000000001,5.2712000000000003,0.12943247133520192,87,null,13,1.6796,4.2295999999999996,0.13263822913916981,87]
[null,null,null,null,13.5,1.8117000000000001,5.5016999999999996,0.11951067611171361,88,null,13.5,2.1127499999999997,4.7227499999999996,0.10248135932391032,88,null,13.5,1.7874000000000003,5.3374000000000006,0.12113544361172168,88,null,13.5,1.7442,4.2942,0.12413570227702754,88]
[null,null,null,null,14,1.8788,5.5687999999999995,0.11157039168088295,89,null,14,2.1909999999999998,4.8010000000000002,9.567250200367082E-2,89,null,14,1.8536000000000001,5.4036,0.11308720969467131,89,null,14,1.8088000000000002,4.3588000000000005,0.1158881312970161,89]
[null,null,null,null,14.5,1.9459,5.6358999999999995,0.10389759049579758,90,null,14.5,2.26925,4.8792499999999999,8.9093013703105614E-2,90,null,14.5,1.9198,5.4697999999999993,0.10531009550253805,90,null,14.5,1.8734000000000002,4.4234,0.10791839508154817,90]
[null,null,null,null,15,2.0130000000000003,5.7030000000000003,9.6510876055060854E-2,91,null,15,2.3474999999999997,4.9574999999999996,8.2758847070857372E-2,91,null,15,1.986,5.5359999999999996,9.7822957451579901E-2,91,null,15,1.9379999999999999,4.4879999999999995,0.1002458170788636,91]
[null,null,null,null,15.5,2.0801000000000003,5.7701000000000002,8.9425484871077182E-2,92,null,15.5,2.4257499999999999,5.0357500000000002,7.6683067538009936E-2,92,null,15.5,2.0522,5.6021999999999998,9.0641239197119014E-2,92,null,15.5,2.0026000000000002,4.5526,9.2886223449679242E-2,92]
[null,null,null,null,16,2.1472000000000002,5.8372000000000002,8.2653379045793993E-2,93,null,16,2.504,5.1139999999999999,7.0875932702527511E-2,93,null,16,2.1184000000000003,5.6684000000000001,8.3777065467866729E-2,93,null,16,2.0672000000000001,4.6172000000000004,8.5852039225584778E-2,93]
[null,null,null,null,16.5,2.2143000000000002,5.9043000000000001,7.6203371508180351E-2,94,null,16.5,2.5822499999999997,5.1922499999999996,6.5344999721391725E-2,94,null,16.5,2.1846000000000001,5.7346000000000004,7.7239369006025654E-2,94,null,16.5,2.1318000000000001,4.6818,7.9152418393171817E-2,94]
[null,null,null,null,17,2.2814000000000001,5.9714,7.0081279714520814E-2,95,null,17,2.6604999999999999,5.2705000000000002,6.0095257109831886E-2,95,null,17,2.2508000000000004,5.8008000000000006,7.1034046357165287E-2,95,null,17,2.1964000000000001,4.7463999999999995,7.2793403542482163E-2,95]
[null,null,null,null,17.5,2.3485000000000005,6.0385000000000009,6.4290103447474975E-2,96,null,17.5,2.73875,5.3487499999999999,5.5129277205438677E-2,96,null,17.5,2.3170000000000002,5.867,6.5164138086489062E-2,96,null,17.5,2.2610000000000001,4.8109999999999999,6.6778110546835537E-2,96]
[null,null,null,null,18,2.4156000000000004,6.1056000000000008,5.8830222280845078E-2,97,null,18,2.8169999999999997,5.4269999999999996,5.0447385495779033E-2,97,null,18,2.3832,5.9331999999999994,5.9630028928167836E-2,97,null,18,2.3256000000000001,4.8756000000000004,6.1106933669422679E-2,97]
[null,null,null,null,18.5,2.4827000000000004,6.1727000000000007,5.3699608298224968E-2,98,null,18.5,2.8952499999999999,5.5052500000000002,4.6047843026337354E-2,98,null,18.5,2.4493999999999998,5.9993999999999996,5.4429663395935059E-2,98,null,18.5,2.3902000000000001,4.9401999999999999,5.5777766514100616E-2,98]
[null,null,null,null,19,2.5498000000000003,6.2398000000000007,4.8894049757583123E-2,99,null,19,2.9735,5.5834999999999999,4.1927038194681528E-2,99,null,19,2.5156000000000001,6.0655999999999999,4.9558772488426425E-2,99,null,19,2.4548000000000001,5.0047999999999995,5.0786234345724941E-2,99]
[null,null,null,null,19.5,2.6169000000000002,6.3069000000000006,4.4407381571397932E-2,100,null,19.5,3.0517499999999997,5.6617499999999996,3.8079684389019861E-2,100,null,19.5,2.5818000000000003,6.1318000000000001,4.5011107302731154E-2,100,null,19.5,2.5194000000000001,5.0693999999999999,4.6125933489795726E-2,100]
[null,null,null,null,20,2.6840000000000002,6.3740000000000006,4.0231718713254844E-2,101,null,20,3.13,5.74,3.4499020136222372E-2,101,null,20,2.6480000000000001,6.1980000000000004,4.0778675614190338E-2,101,null,20,2.5840000000000001,5.1340000000000003,4.1788673771817345E-2,101]
[null,null,null,null,20.5,2.7511000000000001,6.4411000000000005,3.6357688956171919E-2,102,null,20.5,3.2082499999999996,5.818249999999999,3.1177008676794141E-2,102,null,20.5,2.7142000000000004,6.2642000000000007,3.6851977778838876E-2,102,null,20.5,2.6486000000000001,5.1985999999999999,3.7764720262525357E-2,102]
[null,null,null,null,21,2.8182,6.5082000000000004,3.2774661684371972E-2,103,null,21,3.2865000000000002,5.8964999999999996,2.810453417279693E-2,103,null,21,2.7804000000000002,6.3304,3.3220238655911775E-2,103,null,21,2.7132000000000001,5.2631999999999994,3.404303094460312E-2,103]
[null,null,null,null,21.5,2.8853,6.5753000000000004,2.9470969887757218E-2,104,null,21.5,3.3647499999999999,5.9747500000000002,2.5271592069885107E-2,104,null,21.5,2.8466,6.3965999999999994,2.9871632620370289E-2,104,null,21.5,2.7778,5.3277999999999999,3.0611487298274162E-2,104]
[null,null,null,null,22,2.9523999999999999,6.6424000000000003,2.6434122836238021E-2,105,null,22,3.4430000000000001,6.0529999999999999,2.2667471467240526E-2,105,null,22,2.9127999999999998,6.4627999999999997,2.6793499128573608E-2,105,null,22,2.8424,5.3924000000000003,2.7457115206061471E-2,105]
[null,null,null,null,22.5,3.0194999999999999,6.7095000000000002,2.3651007329111341E-2,106,null,22.5,3.5212499999999998,6.1312499999999996,2.0280927690522314E-2,106,null,22.5,2.9790000000000001,6.5289999999999999,2.3972546703676299E-2,106,null,22.5,2.907,5.4569999999999999,2.4566293990454659E-2,106]
[null,null,null,null,23,3.0866000000000002,6.7766000000000002,2.1108075813413701E-2,107,null,23,3.5994999999999999,6.2095000000000002,1.8100343604856971E-2,107,null,23,3.0452000000000004,6.5952000000000002,2.139504361148124E-2,107,null,23,2.9716,5.5215999999999994,2.1924951812384817E-2,107]
[null,null,null,null,23.5,3.1537000000000002,6.8437000000000001,1.8791520056031581E-2,108,null,23.5,3.6777499999999996,6.2877499999999991,1.6113878540060331E-2,108,null,23.5,3.1114000000000002,6.6614000000000004,1.9046993893651328E-2,108,null,23.5,3.0362,5.5861999999999998,1.9518746064391936E-2,108]
[null,null,null,null,24,3.2207999999999997,6.9108000000000001,1.6687429429838228E-2,109,null,24,3.7560000000000002,6.3659999999999997,1.4309604022263833E-2,109,null,24,3.1776000000000004,6.7276000000000007,1.6914297805772565E-2,109,null,24,3.1008000000000004,5.6508000000000003,1.7333227782386128E-2,109]
[null,null,null,null,24.5,3.2879000000000005,6.9779,1.4781933227865378E-2,110,null,24.5,3.8342499999999999,6.4442500000000003,1.2675625809453875E-2,110,null,24.5,3.2438000000000002,6.7938000000000001,1.4982896066310657E-2,110,null,24.5,3.1654,5.7153999999999998,1.5353989467333851E-2,110]
[null,null,null,null,25,3.3550000000000004,7.0449999999999999,1.3061326746325291E-2,111,null,25,3.9125000000000001,6.5225,1.1200192008669995E-2,111,null,25,3.31,6.8599999999999994,1.3238897653752682E-2,111,null,25,3.2300000000000004,5.78,1.3566796047653654E-2,111]
[null,null,null,null,25.5,3.4221000000000004,7.1120999999999999,1.1512181173170769E-2,112,null,25.5,3.9907499999999998,6.6007499999999997,9.8717873063227952E-3,112,null,25.5,3.3761999999999999,6.9261999999999997,1.1668691189120221E-2,112,null,25.5,3.2946,5.8445999999999998,1.19576990204297E-2,112]
[null,null,null,null,26,3.4892000000000003,7.1791999999999998,1.0121437580987803E-2,113,null,26,4.069,6.6790000000000003,8.6792135678502268E-3,113,null,26,3.4424000000000001,6.9923999999999999,1.0259040206711187E-2,113,null,26,3.3592,5.9092000000000002,1.051313408180001E-2,113]
[null,null,null,null,26.5,3.5563000000000002,7.2462999999999997,8.8764855496312935E-3,114,null,26.5,4.1472499999999997,6.7572499999999991,7.6116572572557054E-3,114,null,26.5,3.5085999999999999,7.0586000000000002,8.9971628456232394E-3,114,null,26.5,3.4238,5.9737999999999998,9.22000279226407E-3,114]
[null,null,null,null,27,3.6234000000000002,7.3133999999999997,7.7652271344430725E-3,115,null,27,4.2254999999999994,6.8354999999999997,6.658744290365874E-3,115,null,27,3.5748000000000006,7.1248000000000005,7.8707966876303548E-3,115,null,27,3.4883999999999999,6.0383999999999993,8.0657390204509332E-3,115]
[null,null,null,null,27.5,3.6905000000000001,7.3804999999999996,6.7761270503659205E-3,116,null,27.5,4.30375,6.9137500000000003,5.8105830681092919E-3,116,null,27.5,3.6410000000000005,7.1910000000000007,6.8682496235581885E-3,116,null,27.5,3.5529999999999999,6.1029999999999998,7.0383610693429194E-3,116]
[null,null,null,null,28,3.7576000000000001,7.4475999999999996,5.898250061833068E-3,117,null,28,4.3819999999999997,6.9919999999999991,5.0577965386453469E-3,117,null,28,3.7072000000000003,7.2572000000000001,5.9784377514954358E-3,117,null,28,3.6176000000000004,6.1676000000000002,6.1265105131423818E-3,117]
[null,null,null,null,28.5,3.8247,7.5146999999999995,5.1212866547049015E-3,118,null,28.5,4.4602500000000003,7.0702499999999997,4.3915442112549335E-3,118,null,28.5,3.7734000000000001,7.3233999999999995,5.190911397744696E-3,118,null,28.5,3.6822000000000004,6.2322000000000006,5.3194788627043072E-3,118]
[null,null,null,null,29,3.8917999999999999,7.5817999999999994,4.4355681220386465E-3,119,null,29,4.5385,7.1485000000000003,3.8035350925085224E-3,119,null,29,3.8395999999999999,7.3895999999999997,4.4958704076856898E-3,119,null,29,3.7468000000000004,6.2968000000000002,4.6072232351206249E-3,119]
[null,null,null,null,29.5,3.9589000000000008,7.6489000000000011,3.8320722228419738E-3,120,null,29.5,4.6167499999999997,7.2267499999999991,3.2860325386926156E-3,120,null,29.5,3.9058000000000002,7.4558,3.884169881460679E-3,120,null,29.5,3.8114000000000003,6.3613999999999997,3.9803722314659005E-3,120]
[null,null,null,null,30,4.0260000000000007,7.7160000000000011,3.3024205752146016E-3,121,null,30,4.6949999999999994,7.3049999999999997,2.8318520204076675E-3,121,null,30,3.972,7.5220000000000002,3.3473175316752319E-3,121,null,30,3.8759999999999999,6.4260000000000002,3.4302232290541849E-3,121]
[]
[]
[]
[]
[]
[]
[null,null,null,null,"Marque ","x","y",null,null,null,"Marque ","x","y",null,null,null,"Marque ","x","y",null,null,null,"Marque ","x","y"]
[null,null,null,null,"T1",{"$f":"VLOOKUP(F$278,G283:J403,3,TRUE)","v":95},{"$f":"VLOOKUP(F$278,G283:H403,2,TRUE)","v":7.0081279714520814E-2},null,null,null,"T1",{"$f":"VLOOKUP(L$278,M283:P403,3,TRUE)","v":78},{"$f":"VLOOKUP(L$278,M283:N403,2,TRUE)","v":0.17762612532332042},null,null,null,"T1",{"$f":"VLOOKUP(R$278,S283:V403,3,TRUE)","v":82},{"$f":"VLOOKUP(R$278,S283:T403,2,TRUE)","v":0.17362699447449623},null,null,null,"T1",{"$f":"VLOOKUP(X$278,Y283:AB403,3,TRUE)","v":98},{"$f":"VLOOKUP(X$278,Y283:Z403,2,TRUE)","v":5.5777766514100616E-2}]
[null,null,null,null,"T2",{"$f":"VLOOKUP(F$279,G283:J403,3,TRUE)","v":65},{"$f":"VLOOKUP(F$279,G283:H403,2,TRUE)","v":0.29138799849139779},null,null,null,"T2",{"$f":"VLOOKUP(L$279,M283:P403,3,TRUE)","v":65},{"$f":"VLOOKUP(L$279,M283:N403,2,TRUE)","v":0.24986753608655327},null,null,null,"T2",{"$f":"VLOOKUP(R$279,S283:V403,3,TRUE)","v":82},{"$f":"VLOOKUP(R$279,S283:T403,2,TRUE)","v":0.17362699447449623},null,null,null,"T2",{"$f":"VLOOKUP(X$279,Y283:AB403,3,TRUE)","v":83},{"$f":"VLOOKUP(X$279,Y283:Z403,2,TRUE)","v":0.16861623609330542}]
[]
[null,null,null,null,"Moyenne norme","x","y",null,null,null,"Moyenne norme","x","y",null,null,null,"Moyenne norme","x","y",null,null,null,"Moyenne norme","x","y"]
[]
[]
[null,null,null,null,"Ecart sup","x","y",null,null,null,"Ecart sup","x","y",null,null,null,"Ecart sup","x","y",null,null,null,"Ecart sup","x","y"]
[null,null,null,null,null,71,0,null,null,null,null,71,0,null,null,null,null,71,0,null,null,null,null,71,0]
[null,null,null,null,null,71,{"$f":"VLOOKUP(5,E283:I403,4,TRUE)","v":0.26234376062913523},null,null,null,null,71,{"$f":"VLOOKUP(5,K283:O403,4,TRUE)","v":0.22496187013693258},null,null,null,null,71,{"$f":"VLOOKUP(5,Q283:U403,4,TRUE)","v":0.26591036764675186},null,null,null,null,71,{"$f":"VLOOKUP(5,W283:AA403,4,TRUE)","v":0.27249638294450423}]
[null,null,null,null,"Ecart inf","x","y",null,null,null,"Ecart inf","x","y",null,null,null,"Ecart inf","x","y",null,null,null,"Ecart inf","x","y"]
[null,null,null,null,null,51,0,null,null,null,null,51,0,null,null,null,null,51,0,null,null,null,null,51,0]
[null,null,null,null,null,51,{"$f":"VLOOKUP(-5,E283:I403,4,TRUE)","v":0.26234376062913523},null,null,null,null,51,{"$f":"VLOOKUP(-5,K283:O403,4,TRUE)","v":0.22496187013693264},null,null,null,null,51,{"$f":"VLOOKUP(-5,Q283:U403,4,TRUE)","v":0.26591036764675186},null,null,null,null,51,{"$f":"VLOOKUP(-5,W283:AA403,4,TRUE)","v":0.27249638294450423}]
[null,null,null,null,"Ecart 2 sup","x","y",null,null,null,"Ecart 2 sup","x","y",null,null,null,"Ecart 2 sup","x","y",null,null,null,"Ecart 2 sup","x","y"]
[null,null,null,null,null,91,0,null,null,null,null,91,0,null,null,null,null,91,0,null,null,null,null,91,0]
[null,null,null,null,null,91,{"$f":"VLOOKUP(15,E283:I403,4,TRUE)","v":9.6510876055060854E-2},null,null,null,null,91,{"$f":"VLOOKUP(15,K283:O403,4,TRUE)","v":8.2758847070857372E-2},null,null,null,null,91,{"$f":"VLOOKUP(15,Q283:U403,4,TRUE)","v":9.7822957451579901E-2},null,null,null,null,91,{"$f":"VLOOKUP(15,W283:AA403,4,TRUE)","v":0.1002458170788636}]
[null,null,null,null,"Ecart 2 inf","x","y",null,null,null,"Ecart 2 inf","x","y",null,null,null,"Ecart 2 inf","x","y",null,null,null,"Ecart 2 inf","x","y"]
[null,null,null,null,null,31,0,null,null,null,null,31,0,null,null,null,null,31,0,null,null,null,null,31,0]
[null,null,null,null,null,31,{"$f":"VLOOKUP(-15,E283:J403,4,TRUE)","v":9.6510876055060854E-2},null,null,null,null,31,{"$f":"VLOOKUP(-15,K283:P403,4,TRUE)","v":8.2758847070857372E-2},null,null,null,null,31,{"$f":"VLOOKUP(-15,Q283:V403,4,TRUE)","v":9.7822957451579859E-2},null,null,null,null,31,{"$f":"VLOOKUP(-15,W283:AB403,4,TRUE)","v":0.10024581707886358}]

{"sheet":"Summary T1-T2","index":12,"n_rows":39,"n_cols":9,"rows_kept":39,"cut":false,"hidden":false,"merged":[[38,6,41,8],[33,1,33,4],[34,1,34,4],[35,1,35,4],[26,1,26,4],[27,1,27,4],[28,1,28,4],[29,1,29,4],[30,1,30,4],[31,1,31,4],[14,1,14,4],[32,0,35,0],[1,1,1,4],[2,1,2,4],[3,1,3,4],[4,1,4,4],[5,1,5,4],[6,1,6,4],[1,0,3,0],[4,0,7,0],[8,0,13,0],[13,1,13,4],[15,0,19,0],[20,0,21,0],[22,0,31,0],[32,1,32,4],[22,1,22,4],[23,1,23,4],[24,1,24,4],[25,1,25,4],[20,1,20,4],[21,1,21,4],[19,1,19,4],[15,1,15,4],[16,1,16,4],[17,1,17,4],[18,1,18,4],[0,1,0,4],[9,1,9,4],[10,1,10,4],[11,1,11,4],[12,1,12,4],[7,1,7,4],[8,1,8,4]]}
["Scale","Dimension",null,null,null,null,"Therapeutic target","Observed change","Correspondance"]
["DASS","Depression","Depression","Depression","Depression",{"$f":"DASS!L35","v":"no change"},0,{"$f":"IF(F2=\"no change\",0,1)","v":0},{"$f":"IF(G2=1,IF(H2=1,\"Amélioration conforme aux cibles\",\"Pas d'amélioration alors que celle-ci constitue une cible\"),IF(H2=1,\"Amélioration non ciblée\",\" \"))","v":" "}]
[null,"Anxiety","Anxiety","Anxiety","Anxiety",{"$f":"DASS!L36","v":0.84940588038760545},1,{"$f":"IF(F3=\"no change\",0,1)","v":1},"Amélioration conforme aux cibles"]
[null,"Stress","Stress","Stress","Stress",{"$f":"DASS!L37","v":0.94030147542878206},1,1,"Amélioration conforme aux cibles"]
["REQ-21","Functional - Internal","Functional - Internal","Functional - Internal","Functional - Internal",{"$f":"REQ!M32","v":"no change"},1,0,"Pas d'amélioration alors que celle-ci constitue une cible"]
[null,"Functional - External","Functional - External","Functional - External","Functional - External",{"$f":"REQ!M33","v":"no change"},0,0," "]
[null,"Dysfunctional - Internal","Dysfunctional - Internal","Dysfunctional - Internal","Dysfunctional - Internal",{"$f":"REQ!M34","v":0.80431703084622408},1,1,"Amélioration conforme aux cibles"]
[null,"Dysfunctional - External","Dysfunctional - External","Dysfunctional - External","Dysfunctional - External",{"$f":"REQ!M35","v":"no change"},0,0," "]
["MEAQ","Behavioral avoidance","Behavioral avoidance","Behavioral avoidance","Behavioral avoidance",{"$f":"MEAQ!M73","v":0.87549097951364963},1,1,"Amélioration conforme aux cibles"]
[null,"Distress aversion","Distress aversion","Distress aversion","Distress aversion",{"$f":"MEAQ!M74","v":"no change"},1,0,"Pas d'amélioration alors que celle-ci constitue une cible"]
[null,"Procrastination","Procrastination","Procrastination","Procrastination",{"$f":"MEAQ!M75","v":"no change"},0,0," "]
[null,"Distraction and suppression","Distraction and suppression","Distraction and suppression","Distraction and suppression",{"$f":"MEAQ!M76","v":0.88797048291830849},1,1,"Amélioration conforme aux cibles"]
[null,"Repression and denial","Repression and denial","Repression and denial","Repression and denial",{"$f":"MEAQ!M77","v":"no change"},0,0," "]
[null,"Distress endurance","Distress endurance","Distress endurance","Distress endurance",{"$f":"MEAQ!M78","v":"no change"},0,0," "]
["IUS","Intolerance to uncertainty",null,null,null,{"$f":"IUS!$M$42","v":"no change"},0,0," "]
["MCQ","Positive worry beliefs","Positive worry beliefs","Positive worry beliefs","Positive worry beliefs",{"$f":"MCQ!N41","v":{"$error":"#REF!"}},1,{"$error":"#REF!"},{"$error":"#REF!"}]
[null,"Beliefs about uncontrollability and danger","Beliefs about uncontrollability and danger","Beliefs about uncontrollability and danger","Beliefs about uncontrollability and danger",{"$f":"MCQ!N42","v":{"$error":"#REF!"}},1,{"$error":"#REF!"},{"$error":"#REF!"}]
[null,"Beliefs about cognitive competence","Beliefs about cognitive competence","Beliefs about cognitive competence","Beliefs about cognitive competence",{"$f":"MCQ!N43","v":{"$error":"#REF!"}},1,{"$error":"#REF!"},{"$error":"#REF!"}]
[null,"General negative beliefs (including responsibility, supersition and punishment)","General negative beliefs (including responsibility, supersition and punishment)","General negative beliefs (including responsibility, supersition and punishment)","General negative beliefs (including responsibility, supersition and punishment)",{"$f":"MCQ!N44","v":{"$error":"#REF!"}},1,{"$error":"#REF!"},{"$error":"#REF!"}]
[null,"Cognitive self-consciousness","Cognitive self-consciousness","Cognitive self-consciousness","Cognitive self-consciousness",{"$f":"MCQ!N45","v":{"$error":"#REF!"}},0,{"$error":"#REF!"},{"$error":"#REF!"}]
["CERTS","Constructive rumination","Constructive rumination","Constructive rumination","Constructive rumination",{"$f":"CERTS!N25","v":"no change"},0,0," "]
[null,"Unconstructive rumination","Unconstructive rumination","Unconstructive rumination","Unconstructive rumination",{"$f":"CERTS!N26","v":0.86994393156284577},1,1,"Amélioration conforme aux cibles"]
["SE","…in the relationships within family",null,"…in the relationships within family",null,{"$f":"SE!E5","v":-5},0,{"$f":"IF(F23>10,1,0)","v":0}," "]
[null,"…in the relationships within my couple",null,"…in the relationships within my couple",null,{"$f":"SE!E6","v":0},0,{"$f":"IF(F24>10,1,0)","v":0}," "]
[null,"…in the relationships with my friends",null,"…in the relationships with my friends",null,{"$f":"SE!E7","v":0},0,0," "]
[null,"…in my professional relationships",null,"…in my professional relationships",null,{"$f":"SE!E8","v":0},0,0," "]
[null,"…as a parent",null,"…as a parent",null,{"$f":"SE!E9","v":5},0,0," "]
[null,"…in my sexual life",null,"…in my sexual life",null,{"$f":"SE!E10","v":25},0,1,"Amélioration non ciblée"]
[null,"…in my profession or my studies",null,"…in my profession or my studies",null,{"$f":"SE!E11","v":-10},1,0,"Pas d'amélioration alors que celle-ci constitue une cible"]
[null,"…in the regulation of  my emotions",null,"…in the regulation of  my emotions",null,{"$f":"SE!E12","v":-10},1,0,"Pas d'amélioration alors que celle-ci constitue une cible"]
[null,"...in my free time, my hobbies",null,"...in my free time, my hobbies",null,{"$f":"SE!E13","v":10},1,0,"Pas d'amélioration alors que celle-ci constitue une cible"]
[null,"…in daily tasks / housework",null,"…in daily tasks / housework",null,{"$f":"SE!E14","v":65},1,1,"Amélioration conforme aux cibles"]
["Self-discrepancies","Ideal Self Discrepancy",null,null,null,{"$f":"'Self-Discr'!L39","v":0.99628223156150175},1,1,"Amélioration conforme aux cibles"]
[null,"Ideal Self Distress",null,null,null,{"$f":"'Self-Discr'!L40","v":0.93397728810274527},1,1,"Amélioration conforme aux cibles"]
[null,"Ought Self Discrepancy",null,null,null,{"$f":"'Self-Discr'!L41","v":"no change"},1,0,"Pas d'amélioration alors que celle-ci constitue une cible"]
[null,"Ought Self Distress",null,null,null,{"$f":"'Self-Discr'!L42","v":0.91505176954502143},1,1,"Amélioration conforme aux cibles"]
[]
[]
[null,null,null,null,null,null,"In the \"Therapeutic Target\" column, please encode \"1\" when the dimension was targeted during therapy and \"0\" when it was not the case."]